program: Orca
programVersion: 4.2.1
elementType: S O O O O O O N N N N N N C C C C C C C C C C C C C C C H H H H H H H H H H H H H H H H H H
charge: 0
multiplicity: 1
keywords: wb97x-d3
keywords: def2-TZVPP
keywords: def2/J RIJCOSX GRIDX6 NOFINALGRIDX
keywords: grid4 nofinalgrid
keywords: scfconv7
keywords: smallprint printgap noloewdin
keywords: NOSOSCF
formula: C15H18N6O6S
InChI: InChI=1S/C15H18N6O6S/c1-21(2)13(22)9-6-5-7-16-12(9)27-28(24)20-15(23)19-14-17-10(25-3)8-11(18-14)26-4/h5-8,19-20H,1-4H3
46 atoms
S  -2.017839 -1.400734 -1.964665
O  -2.741346 -0.371609 -2.712283
O  -2.364375 -1.223683 -0.319686
O  0.768458 -2.007851 1.818057
O  0.403286 -2.828348 -1.250771
O  0.438339 3.427417 -1.577697
O  3.889023 2.305043 1.316029
N  -1.337672 -2.788027 2.058967
N  -0.43077 -0.846604 -1.964453
N  -2.218957 1.032203 0.052259
N  1.666534 -0.973674 -0.953331
N  1.043901 1.238235 -1.30524
N  2.792394 0.659856 0.168756
C  -1.840453 -0.179479 0.392177
C  -0.940851 -0.461913 1.420736
C  -0.445559 -1.829945 1.777924
C  -0.378158 0.630176 2.071817
C  -0.759431 1.913053 1.718989
C  -1.68984 2.061269 0.705494
C  -2.746458 -2.569747 2.309576
C  -0.889559 -4.149259 2.267345
C  0.536557 -1.628208 -1.377784
C  1.827171 0.373437 -0.68301
C  1.211408 2.521584 -1.002617
C  2.95209 1.944498 0.454779
C  2.174333 2.950231 -0.106145
C  -0.497011 3.017129 -2.573265
C  4.672878 1.295343 1.94825
H  0.34946 0.472277 2.856508
H  -0.255424 0.169192 -1.999129
H  -2.0284 3.045821 0.407838
H  -3.367726 -3.014441 1.532567
H  -3.011772 -3.034417 3.260256
H  -2.985715 -1.514062 2.395211
H  0.092653 -4.307386 1.835363
H  -1.588647 -4.831976 1.786179
H  -0.848277 -4.397447 3.329013
H  2.301407 -1.572384 -0.441029
H  2.310583 3.992747 0.140498
H  -0.001032 2.537443 -3.416923
H  -0.977529 3.928718 -2.91688
H  -1.260969 2.35068 -2.171562
H  4.054437 0.608993 2.525658
H  5.34251 1.82412 2.620516
H  5.262171 0.730205 1.227016
H  -0.344835 2.778131 2.21514
elementType: S O N C H
totalener: -1760.67572621 hartree
nucrepener: 3197.63297613 hartree
electener: -4958.30870234 hartree
oneelecener: -8773.51212390 hartree
twoeener: 3815.20342156 hartree
cpcmener: -0.04752201 hartree
kineticenergy: 1754.41977048 hartree
xcener: -145.094115169659 hartree
chargesum: -0.0000000
charge: 0.671736 -0.523776 -0.319768 -0.528519 -0.453606 -0.295368 -0.300240 -0.072766 -0.190660 -0.288624 -0.126012 -0.400596 -0.388044 0.209150 -0.016066 0.313058 -0.112290 -0.151138 0.025280 -0.176372 -0.182554 0.289273 0.314861 0.403070 0.423530 -0.315236 -0.115978 -0.113779 0.148417 0.208435 0.161937 0.114705 0.118004 0.120967 0.100632 0.113602 0.121964 0.190449 0.142190 0.131041 0.142254 0.084408 0.112011 0.132686 0.114608 0.163125
qa: 0.6717 -0.5238 -0.3198 -0.5285 -0.4536 -0.2954 -0.3002 -0.0728 -0.1907 -0.2886 -0.1260 -0.4006 -0.3880 0.2091 -0.0161 0.3131 -0.1123 -0.1511 0.0253 -0.1764 -0.1826 0.2893 0.3149 0.4031 0.4235 -0.3152 -0.1160 -0.1138 0.1484 0.2084 0.1619 0.1147 0.1180 0.1210 0.1006 0.1136 0.1220 0.1904 0.1422 0.1310 0.1423 0.0844 0.1120 0.1327 0.1146 0.1631
va: 3.9348 1.9142 2.0042 1.9721 2.0540 2.1116 2.1219 3.2049 3.1133 2.9973 3.1822 2.9223 2.9373 4.1849 3.5175 4.1492 3.9239 3.8685 3.9226 3.8813 3.8931 4.4966 4.2864 3.9616 3.9923 3.9292 3.8289 3.8483 1.0115 1.0726 0.9925 0.9950 0.9929 0.9961 1.0212 0.9920 0.9886 1.0226 1.0188 0.9919 0.9943 1.0059 0.9966 0.9937 0.9949 0.9933
dispcorr: -0.033604724 hartree
energy: -1760.709330931679
dipole: 2.75457 -2.05221 0.70235 0.17847 1.48487 1.66334 14.52301 -12.21059 2.31242
magnitude: 2.93382 au
magnitude: 7.45719 debye
