program: Orca
programVersion: 4.2.1
elementType: S O O O O O O N N N N N N C C C C C C C C C C C C C C C H H H H H H H H H H H H H H H H H H
charge: 0
multiplicity: 1
keywords: wb97x-d3
keywords: def2-TZVPP
keywords: def2/J RIJCOSX GRIDX6 NOFINALGRIDX
keywords: grid4 nofinalgrid
keywords: scfconv7
keywords: smallprint printgap noloewdin
keywords: NOSOSCF
formula: C15H18N6O6S
InChI: InChI=1S/C15H18N6O6S/c1-21(2)13(22)9-6-5-7-16-12(9)27-28(24)20-15(23)19-14-17-10(25-3)8-11(18-14)26-4/h5-8,19-20H,1-4H3
46 atoms
S  1.866107 -1.916002 1.541965
O  2.070532 -3.144472 0.775281
O  0.200872 -1.981665 1.828004
O  -1.598173 0.673556 -0.170353
O  2.380528 0.934243 1.895918
O  -0.697713 3.501311 -3.529022
O  -0.020776 -1.091542 -3.524786
N  -2.376869 -1.419938 0.198924
N  1.857439 -0.691071 0.3979
N  0.174926 -0.778232 3.77273
N  1.677015 1.558316 -0.157699
N  0.519773 2.536205 -1.852723
N  0.889681 0.206117 -1.877111
C  -0.313781 -0.95088 2.565599
C  -1.305003 -0.159183 1.993312
C  -1.769331 -0.28678 0.574822
C  -1.780723 0.895537 2.762159
C  -1.278242 1.09245 4.036539
C  -0.297193 0.23076 4.495057
C  -2.716338 -2.51204 1.086127
C  -2.763337 -1.625366 -1.181677
C  1.991924 0.616742 0.789182
C  0.99049 1.412664 -1.347545
C  -0.180753 2.4187 -2.970922
C  0.162577 0.102555 -2.982577
C  -0.413036 1.200061 -3.59722
C  -0.508893 4.763654 -2.894115
C  0.560554 -2.231546 -2.900292
H  -2.541458 1.554739 2.365418
H  1.477357 -0.860962 -0.547148
H  0.125982 0.3541 5.483562
H  -2.657106 -2.220573 2.130342
H  -3.746343 -2.814902 0.896432
H  -2.075393 -3.378495 0.921686
H  -2.427444 -0.806752 -1.808131
H  -3.848726 -1.697435 -1.266597
H  -2.336552 -2.557637 -1.554695
H  1.758301 2.512019 0.169506
H  -1.001902 1.115201 -4.498471
H  -0.935539 4.778809 -1.891761
H  -1.032553 5.484751 -3.515379
H  0.544666 5.03597 -2.841629
H  1.649226 -2.177822 -2.894252
H  0.251374 -3.085195 -3.496274
H  0.19724 -2.372466 -1.881518
H  -1.63241 1.900567 4.659535
elementType: S O N C H
totalener: -1760.67923721 hartree
nucrepener: 3138.36824404 hartree
electener: -4899.04748124 hartree
oneelecener: -8655.52948900 hartree
twoeener: 3756.48200776 hartree
cpcmener: -0.04819677 hartree
kineticenergy: 1754.44645362 hartree
xcener: -145.095441734579 hartree
chargesum: 0.0000000
charge: 0.699226 -0.544113 -0.313245 -0.520233 -0.470230 -0.301518 -0.297386 -0.062148 -0.204119 -0.304555 -0.126717 -0.412582 -0.408183 0.217578 0.013106 0.286060 -0.138436 -0.151839 0.028912 -0.175933 -0.206531 0.322289 0.351800 0.432126 0.406443 -0.327067 -0.116561 -0.123941 0.151659 0.199772 0.152770 0.123347 0.116967 0.117210 0.111561 0.132643 0.117822 0.191732 0.145331 0.113944 0.133494 0.114049 0.135199 0.145964 0.079135 0.165198
qa: 0.6992 -0.5441 -0.3132 -0.5202 -0.4702 -0.3015 -0.2974 -0.0621 -0.2041 -0.3046 -0.1267 -0.4126 -0.4082 0.2176 0.0131 0.2861 -0.1384 -0.1518 0.0289 -0.1759 -0.2065 0.3223 0.3518 0.4321 0.4064 -0.3271 -0.1166 -0.1239 0.1517 0.1998 0.1528 0.1233 0.1170 0.1172 0.1116 0.1326 0.1178 0.1917 0.1453 0.1139 0.1335 0.1140 0.1352 0.1460 0.0791 0.1652
va: 3.9253 1.9007 1.9994 1.9816 2.0323 2.1207 2.1052 3.1594 3.0863 3.0387 3.1701 2.9463 2.9385 4.1371 3.5475 4.1604 4.0065 3.8917 4.0022 3.8765 3.8792 4.4585 4.2700 3.9936 3.9577 3.9444 3.8459 3.8460 1.0081 1.0791 0.9939 0.9943 0.9956 0.9966 1.0164 0.9950 0.9838 1.0169 1.0160 0.9963 0.9933 0.9951 0.9915 0.9925 0.9955 0.9886
dispcorr: -0.030612044 hartree
energy: -1760.709849250038
dipole: -17.17723 14.41039 -2.76684 0.72054 0.15214 0.87268 -9.39479 8.56166 -0.83313
magnitude: 3.01846 au
magnitude: 7.67232 debye
