program: Orca
programVersion: 4.2.1
elementType: S O O O O O O N N N N N N C C C C C C C C C C C C C C C H H H H H H H H H H H H H H H H H H
charge: 0
multiplicity: 1
keywords: wb97x-d3
keywords: def2-TZVPP
keywords: def2/J RIJCOSX GRIDX6 NOFINALGRIDX
keywords: grid4 nofinalgrid
keywords: scfconv7
keywords: smallprint printgap noloewdin
keywords: NOSOSCF
formula: C15H18N6O6S
InChI: InChI=1S/C15H18N6O6S/c1-21(2)13(22)9-6-5-7-16-12(9)27-28(24)20-15(23)19-14-17-10(25-3)8-11(18-14)26-4/h5-8,19-20H,1-4H3
46 atoms
S  -0.01904 -3.065308 -0.133199
O  -0.77499 -3.499726 -1.308047
O  -1.230632 -2.323724 0.778814
O  -0.573845 1.405424 0.831364
O  2.329739 -1.791163 1.025655
O  -0.881729 1.243001 -3.416511
O  1.894799 4.443586 -1.518596
N  -2.610746 0.440541 0.62899
N  0.785653 -1.683511 -0.634131
N  -0.373906 -2.67018 2.871242
N  2.243498 0.082354 -0.23425
N  0.698766 0.630145 -1.882684
N  2.09539 2.253882 -0.89328
C  -0.841845 -1.81678 1.989224
C  -0.965341 -0.447018 2.200957
C  -1.379708 0.534438 1.147504
C  -0.536608 0.033423 3.43207
C  -0.0421 -0.850682 4.374943
C  0.022581 -2.193317 4.045339
C  -3.634738 -0.475516 1.084398
C  -3.026252 1.323616 -0.441627
C  1.812177 -1.171766 0.116756
C  1.637058 1.025675 -1.040205
C  0.098104 1.578287 -2.591258
C  1.499793 3.185184 -1.623362
C  0.460062 2.910759 -2.504254
C  -1.263983 -0.12581 -3.513762
C  2.947522 4.765718 -0.612519
H  -0.593449 1.091641 3.650129
H  0.375688 -1.070372 -1.356195
H  0.408746 -2.91583 4.752705
H  -3.381047 -0.927016 2.038557
H  -4.564719 0.075361 1.227803
H  -3.820293 -1.264759 0.355748
H  -3.827934 1.982265 -0.103472
H  -3.405786 0.739782 -1.281509
H  -2.201052 1.939296 -0.78146
H  2.97881 0.442733 0.359509
H  -0.026481 3.681764 -3.083216
H  -0.450012 -0.747069 -3.887106
H  -2.085371 -0.153422 -4.223841
H  -1.617178 -0.521495 -2.560268
H  2.687261 4.513484 0.414833
H  3.083263 5.840613 -0.69267
H  3.87812 4.267344 -0.881907
H  0.294243 -0.507319 5.342254
elementType: S O N C H
totalener: -1760.67999930 hartree
nucrepener: 3135.16133272 hartree
electener: -4895.84133202 hartree
oneelecener: -8649.13709082 hartree
twoeener: 3753.29575880 hartree
cpcmener: -0.04850995 hartree
kineticenergy: 1754.43899006 hartree
xcener: -145.094771485164 hartree
chargesum: 0.0000000
charge: 0.698199 -0.544640 -0.313411 -0.525611 -0.470407 -0.296664 -0.301294 -0.060896 -0.202669 -0.304640 -0.125714 -0.404578 -0.411034 0.216542 0.008349 0.296097 -0.138728 -0.152097 0.029289 -0.174035 -0.205675 0.318667 0.352113 0.395215 0.429901 -0.323452 -0.122922 -0.114989 0.152805 0.203004 0.152751 0.122163 0.117014 0.117379 0.132779 0.118123 0.111070 0.191684 0.145116 0.134011 0.145483 0.080295 0.114062 0.132756 0.113875 0.164714
qa: 0.6982 -0.5446 -0.3134 -0.5256 -0.4704 -0.2967 -0.3013 -0.0609 -0.2027 -0.3046 -0.1257 -0.4046 -0.4110 0.2165 0.0083 0.2961 -0.1387 -0.1521 0.0293 -0.1740 -0.2057 0.3187 0.3521 0.3952 0.4299 -0.3235 -0.1229 -0.1150 0.1528 0.2030 0.1528 0.1222 0.1170 0.1174 0.1328 0.1181 0.1111 0.1917 0.1451 0.1340 0.1455 0.0803 0.1141 0.1328 0.1139 0.1647
va: 3.9274 1.9000 1.9973 1.9742 2.0304 2.1057 2.1208 3.1645 3.0863 3.0423 3.1666 2.9314 2.9441 4.1404 3.5593 4.1427 4.0071 3.8935 4.0027 3.8753 3.8782 4.4636 4.2681 3.9673 3.9958 3.9366 3.8461 3.8462 1.0081 1.0748 0.9941 0.9953 0.9954 0.9964 0.9948 0.9840 1.0175 1.0168 1.0163 0.9913 0.9928 0.9945 0.9962 0.9934 0.9954 0.9889
dispcorr: -0.030587582 hartree
energy: -1760.710586884168
dipole: -11.49800 10.17383 -1.32418 15.68578 -13.08818 2.59760 -1.05240 1.68073 0.62833
magnitude: 2.98258 au
magnitude: 7.58110 debye
