program: Orca
programVersion: 4.2.1
elementType: S O O O O O O N N N N N N C C C C C C C C C C C C C C C H H H H H H H H H H H H H H H H H H
charge: 0
multiplicity: 1
keywords: wb97x-d3
keywords: def2-TZVPP
keywords: def2/J RIJCOSX GRIDX6 NOFINALGRIDX
keywords: grid4 nofinalgrid
keywords: scfconv7
keywords: smallprint printgap noloewdin
keywords: NOSOSCF
formula: C15H18N6O6S
InChI: InChI=1S/C15H18N6O6S/c1-21(2)13(22)9-6-5-7-16-12(9)27-28(24)20-15(23)19-14-17-10(25-3)8-11(18-14)26-4/h5-8,19-20H,1-4H3
46 atoms
S  0.063496 -2.830519 -0.091268
O  -0.549302 -3.336149 -1.320222
O  -1.234216 -1.940888 0.530425
O  -2.968894 1.259159 0.576608
O  2.796691 -2.115527 0.706269
O  -0.462359 1.912825 -2.848235
O  3.48083 4.144638 -1.847688
N  -4.067278 -0.706971 0.830151
N  0.98829 -1.505211 -0.529514
N  -0.028442 -1.603315 2.44868
N  2.792098 -0.071788 -0.251575
N  1.131425 0.905765 -1.553948
N  3.139201 2.032981 -1.039881
C  -1.058027 -1.281436 1.703609
C  -1.98875 -0.295386 2.024545
C  -3.060588 0.139331 1.074298
C  -1.782291 0.388836 3.211199
C  -0.710085 0.048209 4.024412
C  0.141143 -0.951474 3.5973
C  -4.224891 -2.001628 1.458703
C  -5.07398 -0.392353 -0.163021
C  2.219518 -1.291389 0.026932
C  2.321367 0.998065 -0.984395
C  0.720774 1.955504 -2.25868
C  2.715183 3.071648 -1.746325
C  1.488435 3.097338 -2.399543
C  -1.278909 0.756671 -2.679179
C  4.740995 4.165164 -1.180763
H  -2.460966 1.179322 3.504151
H  0.594501 -0.74862 -1.111213
H  1.000175 -1.240003 4.189124
H  -3.998605 -2.81214 0.764543
H  -3.595405 -2.105174 2.337959
H  -5.258607 -2.115619 1.785885
H  -4.843214 0.539066 -0.669193
H  -6.056289 -0.303312 0.303393
H  -5.121395 -1.189463 -0.906903
H  3.714243 0.053751 0.144747
H  1.155123 3.950789 -2.971365
H  -0.796621 -0.141677 -3.065114
H  -2.179592 0.944821 -3.256577
H  -1.557297 0.612928 -1.634599
H  4.62765 4.06804 -0.101448
H  5.174843 5.134875 -1.408298
H  5.403908 3.381966 -1.546994
H  -0.533905 0.556793 4.960761
elementType: S O N C H
totalener: -1760.68109663 hartree
nucrepener: 3003.81794505 hartree
electener: -4764.49904168 hartree
oneelecener: -8385.84248772 hartree
twoeener: 3621.34344604 hartree
cpcmener: -0.05234419 hartree
kineticenergy: 1754.42380082 hartree
xcener: -145.094531860383 hartree
chargesum: -0.0000000
charge: 0.693028 -0.544615 -0.295577 -0.541841 -0.486015 -0.298524 -0.299846 -0.078167 -0.219985 -0.378458 -0.140731 -0.429507 -0.426158 0.331680 -0.046995 0.304804 -0.110749 -0.168706 0.023429 -0.181117 -0.170825 0.379494 0.375199 0.426564 0.420876 -0.324766 -0.112283 -0.114158 0.153927 0.198181 0.151907 0.118296 0.125350 0.118625 0.104033 0.119568 0.114319 0.192432 0.148352 0.123032 0.143001 0.076186 0.114636 0.132617 0.114038 0.165449
qa: 0.6930 -0.5446 -0.2956 -0.5418 -0.4860 -0.2985 -0.2998 -0.0782 -0.2200 -0.3785 -0.1407 -0.4295 -0.4262 0.3317 -0.0470 0.3048 -0.1107 -0.1687 0.0234 -0.1811 -0.1708 0.3795 0.3752 0.4266 0.4209 -0.3248 -0.1123 -0.1142 0.1539 0.1982 0.1519 0.1183 0.1253 0.1186 0.1040 0.1196 0.1143 0.1924 0.1484 0.1230 0.1430 0.0762 0.1146 0.1326 0.1140 0.1654
va: 3.9349 1.8952 2.0553 1.9516 2.0263 2.1310 2.1214 3.1716 3.0921 2.9743 3.1788 2.9668 2.9676 3.9962 3.6868 4.1641 3.9758 3.8863 4.0257 3.8829 3.8709 4.4071 4.2503 3.9810 4.0157 3.9318 3.8458 3.8452 1.0025 1.0747 0.9921 0.9956 0.9934 0.9947 1.0258 0.9912 0.9900 1.0165 1.0155 0.9944 0.9972 1.0019 0.9954 0.9934 0.9955 0.9892
dispcorr: -0.025467892 hartree
energy: -1760.706564521281
dipole: -13.85028 12.99163 -0.85865 9.00751 -7.41323 1.59427 1.24397 0.04650 1.29047
magnitude: 2.22358 au
magnitude: 5.65189 debye
