program: Orca
programVersion: 4.2.1
elementType: S O O O O O O N N N N N N C C C C C C C C C C C C C C C H H H H H H H H H H H H H H H H H H
charge: 0
multiplicity: 1
keywords: wb97x-d3
keywords: def2-TZVPP
keywords: def2/J RIJCOSX GRIDX6 NOFINALGRIDX
keywords: grid4 nofinalgrid
keywords: scfconv7
keywords: smallprint printgap noloewdin
keywords: NOSOSCF
formula: C15H18N6O6S
InChI: InChI=1S/C15H18N6O6S/c1-21(2)13(22)9-6-5-7-16-12(9)27-28(24)20-15(23)19-14-17-10(25-3)8-11(18-14)26-4/h5-8,19-20H,1-4H3
46 atoms
S  0.671371 0.450954 2.016318
O  1.97173 -0.18914 2.216585
O  -0.45185 -0.798642 1.74979
O  -2.251993 -3.834418 1.02909
O  -1.152136 2.162741 0.549993
O  1.765877 2.693183 -5.56126
O  3.934569 0.029911 -2.436683
N  -3.220195 -1.820824 0.648527
N  0.709677 0.888285 0.400328
N  -0.488263 -0.952625 4.023458
N  -0.013604 2.164147 -1.401881
N  0.871574 2.428506 -3.478905
N  1.973019 1.066436 -1.900811
C  -0.994022 -1.323623 2.872221
C  -2.041972 -2.231686 2.728671
C  -2.517004 -2.69296 1.384679
C  -2.537752 -2.791936 3.893105
C  -2.023819 -2.398522 5.122609
C  -1.002431 -1.469479 5.136248
C  -3.640393 -0.513663 1.102407
C  -3.626549 -2.152634 -0.699619
C  -0.208577 1.761487 -0.101622
C  0.994596 1.864474 -2.291813
C  1.830359 2.162385 -4.354201
C  2.931435 0.813375 -2.785961
C  2.917126 1.344527 -4.064658
C  0.661107 3.532181 -5.886215
C  3.968463 -0.499328 -1.113257
H  -3.337728 -3.519562 3.843431
H  1.485579 0.582155 -0.201371
H  -0.568471 -1.130428 6.068587
H  -3.503764 -0.393266 2.173109
H  -3.097523 0.282166 0.591187
H  -4.704202 -0.385018 0.896791
H  -4.714119 -2.219162 -0.768875
H  -3.20108 -3.100807 -1.011444
H  -3.289425 -1.377805 -1.390572
H  -0.724396 2.790801 -1.755829
H  3.694968 1.138612 -4.78544
H  0.623569 4.416276 -5.249527
H  -0.286611 2.998183 -5.814947
H  0.820735 3.840376 -6.916232
H  4.882271 -1.084595 -1.054012
H  3.11892 -1.155084 -0.917999
H  4.007835 0.290913 -0.362623
H  -2.405677 -2.808966 6.046126
elementType: S O N C H
totalener: -1760.68750998 hartree
nucrepener: 2897.96361035 hartree
electener: -4658.65112033 hartree
oneelecener: -8173.74969640 hartree
twoeener: 3515.09857607 hartree
cpcmener: -0.04355118 hartree
kineticenergy: 1754.45279172 hartree
xcener: -145.096642392459 hartree
chargesum: -0.0000000
charge: 0.677198 -0.526394 -0.291429 -0.516244 -0.476118 -0.292131 -0.289635 -0.101489 -0.207693 -0.379106 -0.147053 -0.427970 -0.434854 0.351453 -0.067872 0.310231 -0.094666 -0.166378 0.006745 -0.185717 -0.168643 0.376993 0.375747 0.415202 0.420262 -0.325274 -0.116677 -0.128073 0.149828 0.205211 0.149356 0.120051 0.115117 0.120436 0.115302 0.106000 0.109388 0.189203 0.145320 0.113787 0.112946 0.131696 0.138051 0.114156 0.112571 0.161161
qa: 0.6772 -0.5264 -0.2914 -0.5162 -0.4761 -0.2921 -0.2896 -0.1015 -0.2077 -0.3791 -0.1471 -0.4280 -0.4349 0.3515 -0.0679 0.3102 -0.0947 -0.1664 0.0067 -0.1857 -0.1686 0.3770 0.3757 0.4152 0.4203 -0.3253 -0.1167 -0.1281 0.1498 0.2052 0.1494 0.1201 0.1151 0.1204 0.1153 0.1060 0.1094 0.1892 0.1453 0.1138 0.1129 0.1317 0.1381 0.1142 0.1126 0.1612
va: 3.9473 1.9105 2.0673 1.9971 2.0353 2.1302 2.1395 3.1570 3.0930 2.9976 3.1780 2.9664 2.9637 4.0079 3.6858 4.1966 3.9660 3.8834 4.0528 3.8808 3.8715 4.4071 4.2476 4.0264 3.9936 3.9285 3.8497 3.8430 1.0028 1.0709 0.9933 0.9970 0.9968 0.9958 0.9907 1.0273 0.9919 1.0192 1.0163 0.9954 0.9957 0.9935 0.9962 0.9929 0.9947 0.9908
dispcorr: -0.023098960 hartree
energy: -1760.710608939798
dipole: -10.69447 9.45969 -1.23478 -1.28379 2.92425 1.64046 -10.14427 8.65071 -1.49357
magnitude: 2.53900 au
magnitude: 6.45363 debye
