program: Orca
programVersion: 4.2.1
elementType: S O O O O O O N N N N N N C C C C C C C C C C C C C C C H H H H H H H H H H H H H H H H H H
charge: 0
multiplicity: 1
keywords: wb97x-d3
keywords: def2-TZVPP
keywords: def2/J RIJCOSX GRIDX6 NOFINALGRIDX
keywords: grid4 nofinalgrid
keywords: scfconv7
keywords: smallprint printgap noloewdin
keywords: NOSOSCF
formula: C15H18N6O6S
InChI: InChI=1S/C15H18N6O6S/c1-21(2)13(22)9-6-5-7-16-12(9)27-28(24)20-15(23)19-14-17-10(25-3)8-11(18-14)26-4/h5-8,19-20H,1-4H3
46 atoms
S  -2.06028 -1.696111 -1.498401
O  -2.890767 -0.639218 -2.080474
O  -2.379912 -1.754316 0.154023
O  0.868731 -0.062383 1.553157
O  0.558615 -2.974739 -1.301689
O  0.200456 3.261927 -1.145003
O  4.654414 2.302986 -0.239061
N  -0.043739 -2.058928 2.088343
N  -0.540977 -0.9971 -1.46221
N  -3.675915 0.028484 0.724171
N  1.769012 -1.063587 -1.291336
N  0.970946 1.119039 -1.286836
N  3.21952 0.617792 -0.793604
C  -2.518316 -0.582603 0.844144
C  -1.467393 -0.120872 1.637915
C  -0.117767 -0.761806 1.752888
C  -1.669283 1.088097 2.295154
C  -2.883038 1.741059 2.177018
C  -3.860571 1.164133 1.383721
C  -1.132419 -2.844014 2.628035
C  1.242538 -2.723411 2.107326
C  0.586468 -1.762571 -1.345421
C  1.984835 0.287993 -1.120359
C  1.198345 2.40156 -1.0376
C  3.44024 1.905319 -0.575435
C  2.446689 2.873947 -0.669902
C  -1.098117 2.772594 -1.464263
C  5.68083 1.326438 -0.091388
H  -0.880395 1.506382 2.906339
H  -0.424603 0.028227 -1.500681
H  -4.829792 1.634662 1.271064
H  -0.80702 -3.306159 3.561815
H  -1.99865 -2.232723 2.863677
H  -1.433229 -3.63886 1.94509
H  1.138939 -3.724786 1.688693
H  1.621442 -2.817714 3.128181
H  1.975208 -2.178455 1.520298
H  2.591022 -1.642713 -1.182496
H  2.634843 3.918381 -0.468537
H  -1.740086 3.648048 -1.513952
H  -1.479402 2.106376 -0.687231
H  -1.118846 2.265144 -2.429191
H  5.874546 0.797169 -1.02459
H  5.440071 0.602635 0.687567
H  6.571371 1.878995 0.197039
H  -3.069754 2.674474 2.688498
elementType: S O N C H
totalener: -1760.67842353 hartree
nucrepener: 3151.29706976 hartree
electener: -4911.97549329 hartree
oneelecener: -8681.09481569 hartree
twoeener: 3769.11932240 hartree
cpcmener: -0.03867238 hartree
kineticenergy: 1754.44153373 hartree
xcener: -145.095594881129 hartree
chargesum: 0.0000000
charge: 0.668729 -0.517305 -0.320891 -0.493329 -0.453036 -0.292017 -0.293377 -0.058857 -0.215035 -0.278006 -0.142045 -0.405107 -0.412266 0.249220 -0.049728 0.269780 -0.127355 -0.174716 0.045643 -0.175169 -0.196769 0.335722 0.361585 0.423105 0.413723 -0.332658 -0.084112 -0.116876 0.147474 0.207437 0.150793 0.115360 0.119841 0.115958 0.117975 0.128565 0.102102 0.190587 0.143294 0.140937 0.048271 0.126515 0.112243 0.113523 0.130811 0.159461
qa: 0.6687 -0.5173 -0.3209 -0.4933 -0.4530 -0.2920 -0.2934 -0.0589 -0.2150 -0.2780 -0.1420 -0.4051 -0.4123 0.2492 -0.0497 0.2698 -0.1274 -0.1747 0.0456 -0.1752 -0.1968 0.3357 0.3616 0.4231 0.4137 -0.3327 -0.0841 -0.1169 0.1475 0.2074 0.1508 0.1154 0.1198 0.1160 0.1180 0.1286 0.1021 0.1906 0.1433 0.1409 0.0483 0.1265 0.1122 0.1135 0.1308 0.1595
va: 3.9355 1.9245 2.0026 2.0046 2.0640 2.1358 2.1274 3.1602 3.0895 3.0334 3.1702 2.9619 2.9484 4.1515 3.5362 4.1293 3.9440 3.9151 3.9711 3.8783 3.8827 4.4354 4.2552 3.9762 4.0252 3.9477 3.8600 3.8524 1.0151 1.0765 0.9959 0.9939 0.9963 0.9962 0.9957 0.9936 1.0200 1.0168 1.0168 0.9976 0.9956 0.9945 0.9957 0.9960 0.9936 0.9929
dispcorr: -0.031534030 hartree
energy: -1760.709957562375
dipole: 9.27538 -8.04884 1.22653 1.56300 -0.66719 0.89581 13.17436 -11.13343 2.04092
magnitude: 2.54406 au
magnitude: 6.46648 debye
