program: Orca
programVersion: 4.2.1
elementType: S O O O O O O N N N N N N C C C C C C C C C C C C C C C H H H H H H H H H H H H H H H H H H
charge: 0
multiplicity: 1
keywords: wb97x-d3
keywords: def2-TZVPP
keywords: def2/J RIJCOSX GRIDX6 NOFINALGRIDX
keywords: grid4 nofinalgrid
keywords: scfconv7
keywords: smallprint printgap noloewdin
keywords: NOSOSCF
formula: C15H18N6O6S
InChI: InChI=1S/C15H18N6O6S/c1-21(2)13(22)9-6-5-7-16-12(9)27-28(24)20-15(23)19-14-17-10(25-3)8-11(18-14)26-4/h5-8,19-20H,1-4H3
46 atoms
S  0.03616 -2.762409 -0.066572
O  -0.555077 -3.283633 -1.297311
O  -1.26578 -1.839028 0.506419
O  -3.243848 1.245414 0.676945
O  2.77467 -2.082212 0.744642
O  -0.411139 2.009039 -2.812047
O  3.64159 4.09252 -1.937738
N  -4.127831 -0.831442 0.798719
N  0.98451 -1.453834 -0.507257
N  -0.054932 -1.454262 2.405677
N  2.830193 -0.06909 -0.275205
N  1.177559 0.950615 -1.557524
N  3.235415 2.007682 -1.103788
C  -1.11935 -1.194563 1.686565
C  -2.110321 -0.28073 2.043926
C  -3.220282 0.100859 1.114379
C  -1.927965 0.390618 3.241239
C  -0.820783 0.107161 4.030066
C  0.091136 -0.820442 3.565662
C  -4.225719 -2.133046 1.42081
C  -5.149874 -0.540913 -0.184178
C  2.2231 -1.265346 0.040416
C  2.38238 1.004181 -1.01401
C  0.786755 2.010721 -2.257776
C  2.835421 3.05516 -1.809726
C  1.592567 3.123085 -2.429245
C  -1.274831 0.897954 -2.594389
C  4.918296 4.055493 -1.306659
H  -2.653462 1.126994 3.562448
H  0.610331 -0.70396 -1.108412
H  0.978038 -1.06415 4.137257
H  -3.960023 -2.927868 0.722713
H  -3.59082 -2.211297 2.298556
H  -5.252103 -2.300255 1.75032
H  -4.846993 0.276698 -0.831234
H  -6.096097 -0.274649 0.291772
H  -5.315523 -1.423292 -0.801772
H  3.759329 0.039355 0.109904
H  1.275161 3.98434 -2.998691
H  -1.519104 0.779942 -1.537457
H  -0.854094 -0.028944 -2.986662
H  -2.187856 1.123131 -3.139101
H  5.390432 5.004292 -1.547397
H  5.534617 3.241653 -1.688382
H  4.831561 3.962991 -0.223985
H  -0.664871 0.605532 4.975798
elementType: S O N C H
totalener: -1760.68425651 hartree
nucrepener: 2993.85279521 hartree
electener: -4754.53705172 hartree
oneelecener: -8365.63134537 hartree
twoeener: 3611.09429365 hartree
cpcmener: -0.04270849 hartree
kineticenergy: 1754.46316223 hartree
xcener: -145.098672943370 hartree
chargesum: 0.0000000
charge: 0.688603 -0.529822 -0.297874 -0.510235 -0.461597 -0.289914 -0.291676 -0.084968 -0.219488 -0.380149 -0.146442 -0.432052 -0.426474 0.353389 -0.050172 0.293067 -0.112285 -0.170766 0.017984 -0.182944 -0.176932 0.369603 0.373708 0.422980 0.414206 -0.321914 -0.116475 -0.115777 0.149650 0.197442 0.148184 0.117104 0.121130 0.119717 0.102319 0.120156 0.111402 0.188962 0.145743 0.084676 0.118515 0.140607 0.131335 0.113251 0.113082 0.161142
qa: 0.6886 -0.5298 -0.2979 -0.5102 -0.4616 -0.2899 -0.2917 -0.0850 -0.2195 -0.3801 -0.1464 -0.4321 -0.4265 0.3534 -0.0502 0.2931 -0.1123 -0.1708 0.0180 -0.1829 -0.1769 0.3696 0.3737 0.4230 0.4142 -0.3219 -0.1165 -0.1158 0.1497 0.1974 0.1482 0.1171 0.1211 0.1197 0.1023 0.1202 0.1114 0.1890 0.1457 0.0847 0.1185 0.1406 0.1313 0.1133 0.1131 0.1611
va: 3.9393 1.9137 2.0548 1.9925 2.0575 2.1416 2.1307 3.1428 3.0900 2.9695 3.1705 2.9656 2.9655 3.9725 3.6892 4.1793 3.9776 3.8864 4.0396 3.8882 3.8888 4.4196 4.2520 3.9878 4.0250 3.9282 3.8500 3.8498 1.0046 1.0728 0.9928 0.9947 0.9949 0.9923 1.0177 0.9879 0.9921 1.0189 1.0161 1.0059 0.9933 0.9977 0.9936 0.9957 0.9958 0.9910
dispcorr: -0.025236116 hartree
energy: -1760.709492627654
dipole: -13.53902 12.91045 -0.62857 8.16820 -6.80567 1.36252 1.02037 0.09019 1.11056
magnitude: 1.86679 au
magnitude: 4.74501 debye
