program: Orca
programVersion: 4.2.1
elementType: S O O O O O O N N N N N N C C C C C C C C C C C C C C C H H H H H H H H H H H H H H H H H H
charge: 0
multiplicity: 1
keywords: wb97x-d3
keywords: def2-TZVPP
keywords: def2/J RIJCOSX GRIDX6 NOFINALGRIDX
keywords: grid4 nofinalgrid
keywords: scfconv7
keywords: smallprint printgap noloewdin
keywords: NOSOSCF
formula: C15H18N6O6S
InChI: InChI=1S/C15H18N6O6S/c1-21(2)13(22)9-6-5-7-16-12(9)27-28(24)20-15(23)19-14-17-10(25-3)8-11(18-14)26-4/h5-8,19-20H,1-4H3
46 atoms
S  0.117611 -2.319095 0.104734
O  -0.634611 -2.690284 -1.093976
O  -0.939732 -1.378438 1.045015
O  -2.442115 0.723972 3.698676
O  2.32934 -1.040042 1.449018
O  0.381424 1.491278 -3.960563
O  4.042713 4.051162 -2.704815
N  -2.987793 0.812862 1.502831
N  1.00125 -0.981422 -0.380283
N  -1.709294 -3.374586 1.833955
N  2.711579 0.566126 -0.092974
N  1.515813 1.006482 -2.038345
N  3.378053 2.303751 -1.395883
C  -1.791625 -2.066118 1.836662
C  -2.6962 -1.333851 2.605387
C  -2.697229 0.162591 2.640481
C  -3.515596 -2.061295 3.452198
C  -3.443018 -3.448201 3.461926
C  -2.525119 -4.059639 2.63055
C  -3.471754 0.186683 0.293811
C  -2.874855 2.252976 1.434348
C  2.026072 -0.522022 0.393956
C  2.516135 1.317184 -1.23118
C  1.365328 1.760912 -3.122133
C  3.215264 3.047677 -2.480045
C  2.203648 2.824816 -3.407834
C  -0.498057 0.409942 -3.671351
C  5.089728 4.304378 -1.772571
H  -4.22173 -1.546483 4.091106
H  0.756009 -0.468025 -1.236319
H  -2.434277 -5.138166 2.598347
H  -4.348081 0.728869 -0.064699
H  -2.720522 0.2020 -0.497899
H  -3.779718 -0.841275 0.461873
H  -2.376344 2.645556 2.314411
H  -3.858935 2.7193 1.354281
H  -2.293758 2.534817 0.554535
H  3.477478 0.872323 0.492706
H  2.080254 3.438334 -4.288264
H  0.028828 -0.54405 -3.623017
H  -1.205652 0.376551 -4.495475
H  -1.050249 0.57556 -2.744708
H  5.624832 5.167047 -2.161028
H  5.776512 3.461077 -1.697176
H  4.701142 4.540225 -0.781761
H  -4.085203 -4.038469 4.099378
elementType: S O N C H
totalener: -1760.68660296 hartree
nucrepener: 2915.54626396 hartree
electener: -4676.23286692 hartree
oneelecener: -8208.59710710 hartree
twoeener: 3532.36424018 hartree
cpcmener: -0.04508604 hartree
kineticenergy: 1754.45465325 hartree
xcener: -145.096796489359 hartree
chargesum: 0.0000000
charge: 0.680578 -0.529801 -0.302220 -0.515418 -0.473242 -0.291676 -0.292073 -0.102293 -0.210584 -0.378438 -0.148809 -0.437024 -0.426825 0.378117 -0.064049 0.311855 -0.105436 -0.171217 0.013678 -0.176326 -0.168236 0.378730 0.377622 0.420657 0.414977 -0.324166 -0.118446 -0.115752 0.149778 0.196725 0.148810 0.118954 0.100087 0.124785 0.105481 0.115646 0.106307 0.190350 0.145156 0.113665 0.138258 0.103279 0.131416 0.113355 0.113539 0.160224
qa: 0.6806 -0.5298 -0.3022 -0.5154 -0.4732 -0.2917 -0.2921 -0.1023 -0.2106 -0.3784 -0.1488 -0.4370 -0.4268 0.3781 -0.0640 0.3119 -0.1054 -0.1712 0.0137 -0.1763 -0.1682 0.3787 0.3776 0.4207 0.4150 -0.3242 -0.1184 -0.1158 0.1498 0.1967 0.1488 0.1190 0.1001 0.1248 0.1055 0.1156 0.1063 0.1903 0.1452 0.1137 0.1383 0.1033 0.1314 0.1134 0.1135 0.1602
va: 3.9482 1.9126 2.0810 2.0006 2.0422 2.1393 2.1307 3.1437 3.1020 2.9988 3.1760 2.9635 2.9658 3.9656 3.6436 4.1941 3.9736 3.8907 4.0495 3.8846 3.8803 4.4196 4.2441 3.9907 4.0270 3.9272 3.8630 3.8494 1.0049 1.0751 0.9937 0.9960 0.9993 0.9946 1.0256 0.9894 0.9924 1.0181 1.0165 0.9920 0.9971 0.9858 0.9934 0.9956 0.9955 0.9913
dispcorr: -0.023190810 hartree
energy: -1760.709793769359
dipole: -9.54936 8.79920 -0.75016 13.98818 -12.45775 1.53042 -5.36474 3.29547 -2.06926
magnitude: 2.68082 au
magnitude: 6.81410 debye
