program: Orca
programVersion: 4.2.1
elementType: S O O O O O O N N N N N N C C C C C C C C C C C C C C C H H H H H H H H H H H H H H H H H H
charge: 0
multiplicity: 1
keywords: wb97x-d3
keywords: def2-TZVPP
keywords: def2/J RIJCOSX GRIDX6 NOFINALGRIDX
keywords: grid4 nofinalgrid
keywords: scfconv7
keywords: smallprint printgap noloewdin
keywords: NOSOSCF
formula: C15H18N6O6S
InChI: InChI=1S/C15H18N6O6S/c1-21(2)13(22)9-6-5-7-16-12(9)27-28(24)20-15(23)19-14-17-10(25-3)8-11(18-14)26-4/h5-8,19-20H,1-4H3
46 atoms
S  -0.012049 -3.015424 -0.14235
O  -0.727857 -3.406856 -1.349572
O  -1.255983 -2.315219 0.786419
O  -0.465314 1.340915 1.056358
O  2.221981 -1.583321 1.172858
O  -0.814699 1.198685 -3.558913
O  1.950398 4.481747 -1.775758
N  -2.533422 0.486094 0.719497
N  0.768499 -1.59138 -0.575727
N  -0.503091 -2.819315 2.88281
N  2.166617 0.224338 -0.184778
N  0.66869 0.684726 -1.903591
N  2.071976 2.345421 -0.993188
C  -0.910621 -1.904652 2.033821
C  -1.003696 -0.544351 2.328704
C  -1.316125 0.504006 1.303377
C  -0.614948 -0.152962 3.601501
C  -0.196781 -1.108427 4.511707
C  -0.153542 -2.430019 4.098515
C  -3.610812 -0.404927 1.076827
C  -2.840468 1.427703 -0.332012
C  1.741593 -1.032818 0.213287
C  1.597559 1.115053 -1.063581
C  0.131913 1.583483 -2.71739
C  1.527897 3.229837 -1.811322
C  0.521951 2.911551 -2.71919
C  -1.195158 -0.168978 -3.575228
C  2.950381 4.825793 -0.829705
H  -0.633552 0.895455 3.869074
H  0.375471 -1.013558 -1.329923
H  0.180168 -3.209834 4.772794
H  -4.529157 0.171772 1.204787
H  -3.784167 -1.157785 0.305835
H  -3.414287 -0.914293 2.015583
H  -3.162357 0.899035 -1.232288
H  -1.968913 2.028929 -0.568206
H  -3.65028 2.095091 -0.027725
H  2.833292 0.64106 0.447609
H  0.086093 3.643322 -3.38162
H  -1.615485 -0.492248 -2.620783
H  -0.360223 -0.823577 -3.828431
H  -1.958658 -0.252906 -4.34392
H  3.127389 5.889607 -0.964173
H  3.87715 4.277998 -1.002324
H  2.620848 4.636362 0.192129
H  0.106214 -0.835406 5.512334
totalener: -1760.65262779 hartree
nucrepener: 3123.33689191 hartree
electener: -4883.98951969 hartree
oneelecener: -8624.15772410 hartree
twoeener: 3740.16820440 hartree
kineticenergy: 1754.51116154 hartree
xcener: -145.095345277337 hartree
chargesum: 0.0000000
charge: 0.687946 -0.477459 -0.312969 -0.426533 -0.360361 -0.264156 -0.266470 -0.079423 -0.204822 -0.260709 -0.144804 -0.401796 -0.388851 0.223770 -0.003501 0.255215 -0.125816 -0.123112 0.030394 -0.182800 -0.201630 0.267158 0.364032 0.362442 0.398822 -0.299169 -0.128631 -0.127903 0.125949 0.186549 0.119638 0.100783 0.120433 0.111780 0.100934 0.117532 0.113093 0.165841 0.125198 0.082763 0.122247 0.131198 0.121496 0.106870 0.112675 0.126156
qa: 0.6879 -0.4775 -0.3130 -0.4265 -0.3604 -0.2642 -0.2665 -0.0794 -0.2048 -0.2607 -0.1448 -0.4018 -0.3889 0.2238 -0.0035 0.2552 -0.1258 -0.1231 0.0304 -0.1828 -0.2016 0.2672 0.3640 0.3624 0.3988 -0.2992 -0.1286 -0.1279 0.1259 0.1865 0.1196 0.1008 0.1204 0.1118 0.1009 0.1175 0.1131 0.1658 0.1252 0.0828 0.1222 0.1312 0.1215 0.1069 0.1127 0.1262
va: 3.9316 1.9727 1.9979 2.0754 2.1424 2.1331 2.1501 3.1321 3.0814 3.0641 3.1648 2.9272 2.9550 4.1301 3.6090 4.1755 4.0355 3.8926 4.0494 3.8926 3.8883 4.4928 4.2519 4.0122 4.0528 3.9298 3.8760 3.8788 1.0155 1.0820 0.9991 0.9952 0.9943 1.0012 0.9847 1.0271 0.9971 1.0376 1.0230 0.9937 0.9959 0.9938 0.9939 0.9972 0.9966 1.0013
dispcorr: -0.030340058 hartree
energy: -1760.682967846586
dipole: -11.05301 10.28332 -0.76970 15.52741 -13.78759 1.73982 -1.32016 1.68252 0.36236
magnitude: 1.93668 au
magnitude: 4.92264 debye
