program: Orca
programVersion: 4.2.1
elementType: S O O O O O O N N N N N N C C C C C C C C C C C C C C C H H H H H H H H H H H H H H H H H H
charge: 0
multiplicity: 1
keywords: wb97x-d3
keywords: def2-TZVPP
keywords: def2/J RIJCOSX GRIDX6 NOFINALGRIDX
keywords: grid4 nofinalgrid
keywords: scfconv7
keywords: smallprint printgap noloewdin
keywords: NOSOSCF
formula: C15H18N6O6S
InChI: InChI=1S/C15H18N6O6S/c1-21(2)13(22)9-6-5-7-16-12(9)27-28(24)20-15(23)19-14-17-10(25-3)8-11(18-14)26-4/h5-8,19-20H,1-4H3
46 atoms
S  0.021565 -2.751612 -0.079103
O  -0.560532 -3.310598 -1.288595
O  -1.290306 -1.790257 0.466161
O  -3.424111 1.133449 0.552982
O  2.787328 -2.122503 0.660985
O  -0.380665 2.187685 -2.686379
O  3.797015 4.057808 -1.925886
N  -4.238328 -0.960014 0.850095
N  0.974514 -1.444739 -0.537355
N  -0.064811 -1.290472 2.328449
N  2.855305 -0.092915 -0.321519
N  1.198633 1.024055 -1.515252
N  3.322007 1.97832 -1.119431
C  -1.156113 -1.116182 1.622169
C  -2.196555 -0.255722 1.982764
C  -3.344614 0.030627 1.061111
C  -2.027634 0.462735 3.152042
C  -0.889127 0.26984 3.924915
C  0.064456 -0.618285 3.465887
C  -4.193156 -2.2576 1.478488
C  -5.28394 -0.788882 -0.131343
C  2.228862 -1.292126 -0.008579
C  2.425259 1.011817 -1.018147
C  0.832293 2.118226 -2.176845
C  2.9446 3.057122 -1.788099
C  1.684324 3.196573 -2.355926
C  -1.303315 1.137883 -2.424308
C  5.085437 3.93257 -1.346596
H  -2.786584 1.171585 3.45702
H  0.589568 -0.677026 -1.099959
H  0.977077 -0.797856 4.021117
H  -5.193497 -2.529379 1.820698
H  -3.848548 -3.028674 0.78626
H  -3.542723 -2.256595 2.348789
H  -5.227189 0.202159 -0.568869
H  -6.266059 -0.91165 0.330173
H  -5.185266 -1.532949 -0.92522
H  3.7961 -0.022653 0.035456
H  1.385853 4.083969 -2.892198
H  -0.958808 0.184402 -2.828577
H  -2.22197 1.424567 -2.927953
H  -1.506547 1.035418 -1.358372
H  5.033125 3.817483 -0.263523
H  5.606147 4.855441 -1.587953
H  5.635198 3.086302 -1.759345
H  -0.741873 0.80761 4.850203
totalener: -1760.65511714 hartree
nucrepener: 2986.88160046 hartree
electener: -4747.53671759 hartree
oneelecener: -8350.87044253 hartree
twoeener: 3603.33372494 hartree
kineticenergy: 1754.51656248 hartree
xcener: -145.095562610877 hartree
chargesum: 0.0000000
charge: 0.680387 -0.459053 -0.305965 -0.409568 -0.367477 -0.262306 -0.264278 -0.104252 -0.220901 -0.348834 -0.171308 -0.430363 -0.408891 0.343143 -0.057254 0.251291 -0.097649 -0.134424 0.001015 -0.190053 -0.177787 0.332986 0.364868 0.401967 0.383898 -0.298245 -0.129746 -0.125018 0.126053 0.187923 0.127037 0.101811 0.121297 0.113052 0.114516 0.097420 0.106171 0.167231 0.128891 0.106545 0.124867 0.113160 0.107312 0.123223 0.108001 0.129306
qa: 0.6804 -0.4591 -0.3060 -0.4096 -0.3675 -0.2623 -0.2643 -0.1043 -0.2209 -0.3488 -0.1713 -0.4304 -0.4089 0.3431 -0.0573 0.2513 -0.0976 -0.1344 0.0010 -0.1901 -0.1778 0.3330 0.3649 0.4020 0.3839 -0.2982 -0.1297 -0.1250 0.1261 0.1879 0.1270 0.1018 0.1213 0.1131 0.1145 0.0974 0.1062 0.1672 0.1289 0.1065 0.1249 0.1132 0.1073 0.1232 0.1080 0.1293
va: 3.9406 1.9896 2.0454 2.0969 2.1516 2.1662 2.1484 3.1331 3.0938 2.9809 3.1553 2.9643 2.9705 3.9632 3.7174 4.2210 4.0012 3.8649 4.0728 3.8948 3.8789 4.4301 4.2460 4.0216 4.0541 3.9338 3.8595 3.8776 1.0113 1.0714 0.9965 0.9966 0.9953 0.9982 1.0306 0.9940 0.9898 1.0360 1.0219 0.9917 1.0013 1.0104 0.9969 0.9940 0.9971 1.0016
dispcorr: -0.025109101 hartree
energy: -1760.680226240488
dipole: -13.36395 12.94523 -0.41872 7.65226 -6.59275 1.05951 1.60625 -0.77006 0.83620
magnitude: 1.41319 au
magnitude: 3.59205 debye
