program: Orca
programVersion: 4.2.1
elementType: S O O O O O O N N N N N N C C C C C C C C C C C C C C C H H H H H H H H H H H H H H H H H H
charge: 0
multiplicity: 1
keywords: wb97x-d3
keywords: def2-TZVPP
keywords: def2/J RIJCOSX GRIDX6 NOFINALGRIDX
keywords: grid4 nofinalgrid
keywords: scfconv7
keywords: smallprint printgap noloewdin
keywords: NOSOSCF
formula: C15H18N6O6S
InChI: InChI=1S/C15H18N6O6S/c1-21(2)13(22)9-6-5-7-16-12(9)27-28(24)20-15(23)19-14-17-10(25-3)8-11(18-14)26-4/h5-8,19-20H,1-4H3
46 atoms
S  0.026858 -2.763242 -0.090162
O  -0.562551 -3.310453 -1.30128
O  -1.282091 -1.804068 0.469488
O  -3.389491 1.138752 0.566741
O  2.794839 -2.124647 0.656872
O  -0.389454 2.161493 -2.704697
O  3.755588 4.080609 -1.891038
N  -4.223047 -0.946471 0.866783
N  0.980255 -1.45499 -0.544509
N  -0.044269 -1.314702 2.326169
N  2.851664 -0.092413 -0.321345
N  1.193191 1.010996 -1.5252
N  3.300048 1.989761 -1.102223
C  -1.137391 -1.131452 1.624959
C  -2.169063 -0.262389 1.990656
C  -3.318227 0.034945 1.073886
C  -1.988506 0.454761 3.159054
C  -0.847522 0.253113 3.926007
C  0.096581 -0.642718 3.462376
C  -4.188934 -2.244863 1.493728
C  -5.273519 -0.762927 -0.107023
C  2.232176 -1.296841 -0.012158
C  2.414892 1.01106 -1.015653
C  0.81977 2.103882 -2.184687
C  2.915788 3.067204 -1.769179
C  1.660369 3.19309 -2.35085
C  -1.303218 1.102281 -2.45102
C  5.035975 3.973588 -1.291036
H  -2.739804 1.17031 3.46734
H  0.59585 -0.689911 -1.111518
H  1.009927 -0.830331 4.013723
H  -3.867769 -3.020118 0.795033
H  -3.524449 -2.255716 2.353081
H  -5.18776 -2.501375 1.851652
H  -5.187859 -1.506484 -0.902955
H  -5.209913 0.228323 -0.543179
H  -6.253717 -0.876861 0.360975
H  3.789772 -0.013891 0.04102
H  1.356052 4.079331 -2.885681
H  -0.948661 0.15397 -2.858124
H  -2.222528 1.382721 -2.956891
H  -1.509358 0.993427 -1.386487
H  4.967585 3.846301 -0.21027
H  5.542929 4.908557 -1.514117
H  5.60876 3.142276 -1.702755
H  -0.690898 0.790324 4.850103
totalener: -1760.65505190 hartree
nucrepener: 2988.54692993 hartree
electener: -4749.20198184 hartree
oneelecener: -8354.20888214 hartree
twoeener: 3605.00690031 hartree
kineticenergy: 1754.51637025 hartree
xcener: -145.095487714074 hartree
chargesum: -0.0000000
charge: 0.680620 -0.458993 -0.305850 -0.409035 -0.366585 -0.262397 -0.264232 -0.104229 -0.221251 -0.349063 -0.171224 -0.430027 -0.408948 0.341809 -0.055803 0.250810 -0.098290 -0.134112 0.001021 -0.189606 -0.177742 0.331675 0.365097 0.401838 0.383519 -0.297470 -0.129562 -0.125117 0.125985 0.188058 0.127190 0.121254 0.112789 0.101825 0.105889 0.114589 0.097495 0.167178 0.129014 0.107399 0.124639 0.112074 0.107121 0.123265 0.108116 0.129267
qa: 0.6806 -0.4590 -0.3059 -0.4090 -0.3666 -0.2624 -0.2642 -0.1042 -0.2213 -0.3491 -0.1712 -0.4300 -0.4089 0.3418 -0.0558 0.2508 -0.0983 -0.1341 0.0010 -0.1896 -0.1777 0.3317 0.3651 0.4018 0.3835 -0.2975 -0.1296 -0.1251 0.1260 0.1881 0.1272 0.1213 0.1128 0.1018 0.1059 0.1146 0.0975 0.1672 0.1290 0.1074 0.1246 0.1121 0.1071 0.1233 0.1081 0.1293
va: 3.9399 1.9898 2.0465 2.0976 2.1526 2.1661 2.1483 3.1325 3.0932 2.9798 3.1546 2.9649 2.9706 3.9657 3.7162 4.2213 4.0019 3.8646 4.0718 3.8954 3.8785 4.4311 4.2459 4.0219 4.0548 3.9337 3.8602 3.8777 1.0113 1.0718 0.9965 0.9951 0.9986 0.9964 0.9899 1.0307 0.9940 1.0360 1.0218 0.9917 1.0012 1.0098 0.9971 0.9940 0.9969 1.0016
dispcorr: -0.025132287 hartree
energy: -1760.680184189136
dipole: -13.42911 13.00257 -0.42654 7.78701 -6.72419 1.06283 1.74660 -0.90115 0.84545
magnitude: 1.42349 au
magnitude: 3.61821 debye
