program: Orca
programVersion: 5.0.2
elementType: Cl S O O O O O N N N N N C C C C C C C C C C C C C C H H H H H H H H H H H H H H H H
charge: 0
multiplicity: 1
keywords: wb97x-d3
keywords: def2-TZVPP
keywords: def2/J RIJCOSX
keywords: DEFGRID2
keywords: scfconv7
keywords: smallprint printgap noloewdin
keywords: NOSOSCF
formula: C14H16ClN5O5S
InChI: InChI=1S/C14H16ClN5O5S/c1-9-16-12(19-14(17-9)24-2)18-13(21)20-26(22,23)11-6-4-3-5-10(11)25-8-7-15/h3-6,18,20H,7-8H2,1-2H3
42 atoms
Cl 1.527454 2.293219 0.219316
S  -2.00629 -1.271712 -0.883398
O  -1.461081 1.514164 -0.173736
O  -2.571525 -2.60691 -0.854949
O  -1.807018 -0.62205 -2.166349
O  -1.10887 -2.103859 1.814691
O  3.218293 -0.126131 -2.283373
N  -0.483212 -1.30572 -0.216682
N  1.060398 -1.570154 1.500597
N  3.257418 -0.964698 1.581663
N  2.100437 -0.901883 -0.462058
N  4.352907 -0.243176 -0.372997
C  -2.963529 -0.244768 0.175031
C  -2.608531 1.097966 0.371334
C  -4.11944 -0.773731 0.7327
C  -3.457485 1.89927 1.130856
C  -4.951851 0.032563 1.487347
C  -4.614343 1.364147 1.675949
C  -1.116716 2.890195 -0.079744
C  -0.244307 -1.693153 1.06855
C  0.222995 3.095152 -0.721896
C  2.174645 -1.126313 0.840856
C  4.328819 -0.529437 0.921179
C  3.206639 -0.43354 -1.008961
C  5.583889 -0.368405 1.697808
C  2.004306 -0.230953 -3.031514
H  -4.375705 -1.811416 0.57362
H  -3.232845 2.941676 1.305577
H  0.303477 -0.964978 -0.784512
H  -5.854738 -0.375629 1.918176
H  -5.258818 2.007083 2.260302
H  -1.851029 3.501827 -0.614201
H  -1.089739 3.218644 0.962213
H  1.196032 -1.790746 2.479696
H  0.446106 4.158866 -0.741627
H  0.257241 2.707739 -1.737958
H  6.319733 0.214875 1.151788
H  5.386472 0.101503 2.659792
H  6.010383 -1.352784 1.902362
H  2.25546 0.083974 -4.039462
H  1.635435 -1.255058 -3.056856
H  1.234953 0.428394 -2.629735
elementType: Cl S O N C H
totalener: -2051.61104008 hartree
nucrepener: 2938.86020395 hartree
electener: -4990.47124403 hartree
oneelecener: -8661.48891916 hartree
twoeener: 3671.01767514 hartree
cpcmener: -0.05910718 hartree
kineticenergy: 2045.22547255 hartree
xcener: -151.024268955209 hartree
chargesum: 0.0000000
charge: -0.178729 0.892004 -0.313012 -0.518624 -0.527150 -0.487180 -0.272728 -0.198303 -0.127113 -0.405082 -0.408046 -0.361281 -0.183808 0.381683 -0.071738 -0.219010 -0.199732 -0.122026 0.014786 0.387085 -0.086481 0.364312 0.335477 0.417850 -0.240440 -0.108281 0.153561 0.144643 0.224676 0.164252 0.165411 0.128278 0.112641 0.195495 0.143219 0.125792 0.096459 0.104840 0.114912 0.138716 0.124309 0.098362
qa: -0.1787 0.8920 -0.3130 -0.5186 -0.5271 -0.4872 -0.2727 -0.1983 -0.1271 -0.4051 -0.4080 -0.3613 -0.1838 0.3817 -0.0717 -0.2190 -0.1997 -0.1220 0.0148 0.3871 -0.0865 0.3643 0.3355 0.4179 -0.2404 -0.1083 0.1536 0.1446 0.2247 0.1643 0.1654 0.1283 0.1126 0.1955 0.1432 0.1258 0.0965 0.1048 0.1149 0.1387 0.1243 0.0984
va: 1.1131 5.8123 2.1000 1.9758 1.9576 2.0244 2.1312 3.0774 3.2030 3.0071 2.9163 2.9995 3.7854 3.8266 3.9149 3.9024 3.9464 3.9193 3.8496 4.3985 4.0031 4.2538 3.9421 4.2787 3.9331 3.8452 1.0144 1.0064 1.0489 0.9886 0.9866 0.9924 0.9982 1.0163 1.0034 0.9972 1.0169 1.0074 1.0002 0.9963 0.9936 0.9916
dispcorr: -0.025361389 hartree
energy: -2051.636401468594
dipole: 1.21918 -0.94838 0.27081 8.66467 -5.18289 3.48178 0.71663 0.01914 0.73577
magnitude: 3.56896 au
magnitude: 9.07157 debye
