program: Gaussian 09
title: 000073934
version: EM64L-G09RevD.01
frameworkgroup: C1[X(C5H3F2N)]
method: RPBEPBE
basis: SDD
operation: Freq
keyword: #pfreq=noraman
keyword: PBEPBE/SDD
title: #p freq=noraman PBEPBE/SDD
converged: YES YES YES YES
title: Mulliken charges:
elementType: F F N C C C C C H H H
charge: -0.169553 -0.169563 0.042035 -0.105283 -0.313633 -0.313631 0.121630 0.121628 0.254103 0.266133 0.266134
chargesum: 0.00000
title: Mulliken charges with hydrogens summed into heavy atoms:
elementType: F F N C C C C C
charge: -0.169553 -0.169563 0.042035 0.148819 -0.047500 -0.047497 0.121630 0.121628
polarizability: 7.57581193e+01 -3.78937845e-05 6.46588228e+01 4.57264388e-03 -3.00697680e-03 2.41175215e+01
1716.lowfreq: -0.0009 -0.0005 0.0007 1.8232 5.5867 7.0800 195.9910 227.9813 316.7236
frequency: 195.9888 227.9809 316.7236 458.5841 463.8543 509.9789 538.2657 631.2671 710.2617 716.2319 794.5979 873.2223 937.3529 946.4019 973.3279 1060.0433 1158.4986 1200.1793 1255.1203 1359.9517 1411.2940 1424.9782 1576.2650 1579.8883 3166.7220 3196.2147 3203.6055
redmass: 4.5285 11.3238 14.5153 3.8941 6.2767 12.0340 9.4201 6.1151 9.1520 2.8023 1.5806 1.3610 6.2440 6.5983 1.3149 1.5683 1.1120 2.0940 5.8303 9.1777 3.5233 2.5263 7.0461 7.3670 1.0901 1.0942 1.0996
irintensity: 0.0000 0.1695 2.1943 0.2174 1.1142 1.1594 5.1643 0.0000 12.3547 9.5612 97.9658 0.0000 98.7771 6.2991 0.7342 7.5405 1.9954 82.7816 55.0902 2.8676 2.4782 212.8987 127.6047 116.0493 4.7478 0.8411 0.2756
temp: 298.150 k
press: 1.00000 atm
elementType: 9 9 7 6 6 6 6 6 1 1 1
symmnumber: 1
zpe: 184744.1 jmol-1
zpe.correction: 0.070365 hartree
zpe.thermalcorrener: 0.076346 hartree
zpe.thermalcorrenthalpy: 0.077290 hartree
zpe.thermalcorrgfe: 0.040074 hartree
zpe.sumelectzpe: -446.191192 hartree
zpe.sumelectthermal: -446.185212 hartree
zpe.sumelectthermalent: -446.184267 hartree
zpe.sumelectthermalfe: -446.221483 hartree
dipole: -0.0001 -4.8025 0.0004
dipole: 4.8025
quadrupole: -46.2017 -43.2588 -45.1066
quadrupole: -0.0001 -0.0007 -0.0001
quadrupole: -1.3460 1.5969 -0.2509 -0.0001 -0.0007 -0.0001
hfenergy: -446.2615572 hartree
pointgroup: C01 [X(C5H3F2N1)]
dipole: -0.0001664 -1.88946 0.000161 debye
dipolederiv: -0.8822852 0.369385 -0.0001218 0.4409833 -0.4641524 0.0000785 -0.0002427 0.0001353 -0.1781526 -0.8823966 -0.3693164 -0.000056 -0.4409142 -0.4640364 -0.0000288 -0.0001448 -0.0000778 -0.1781626 -0.8595601 0.0000371 -0.0001667 0.0000405 -0.4334624 0.0000162 -0.0000956 0.0000296 -0.1524704 0.3468348 -0.0000053 0.0000034 -0.0000113 0.2165958 -0.0000229 0.0000298 -0.000027 -0.1077024 -0.2070929 0.0506348 -0.0000078 0.3671346 -0.3204316 0.000046 -0.0000648 0.000046 -0.1473009 -0.2071471 -0.0506476 0.0000066 -0.3671469 -0.3203807 -0.0000153 0.000004 -0.0000226 -0.1472949 1.2861029 -0.3084848 0.0002269 -0.5515311 0.8417087 -0.0000921 0.0003394 -0.0002089 0.1769414 1.2862154 0.3084019 0.0001529 0.5514505 0.8415886 -0.0000143 0.0002112 0.0000866 0.1769404 0.1009248 -0.000013 -0.0000067 -0.0000107 -0.0544532 0.0000157 0.0000186 0.0000184 0.1585634 0.0091931 -0.0471582 -0.0000107 -0.0586571 0.0785175 -0.0000051 -0.0000211 0.0000033 0.1993196 0.0092109 0.0471666 -0.0000201 0.0586625 0.0785061 0.0000221 -0.000034 0.0000171 0.199319 unknown
polarizability: 75.7581192|-0.0007997|64.6588228|0.0045724|-0.0030073|24.1175215 unknown
InChI: InChI=1S/C5H3F2N/c6-4-2-1-3-5(7)8-4/h1-3H
charge 0 multiplicity 1
11 atoms
F  -2.319516 1.092253 -0.000368
F  2.319687 1.091936 0.000287
N  0.000077 1.049287 -0.000011
C  -0.000106 -1.767147 0.000188
C  -1.22589 -1.060633 0.00006
C  1.225768 -1.060794 0.000222
C  -1.138231 0.345302 0.000007
C  1.138279 0.345151 0.000074
H  -0.000186 -2.861033 0.00027
H  -2.196112 -1.560621 -0.000006
H  2.195931 -1.560901 0.000376
