program: Orca
programVersion: 5.0.2
elementType: Cl S O O O O O N N N N N C C C C C C C C C C C C C C H H H H H H H H H H H H H H H H
charge: 0
multiplicity: 1
keywords: wb97x-d3
keywords: def2-TZVPP
keywords: def2/J RIJCOSX
keywords: DEFGRID2
keywords: scfconv7
keywords: smallprint printgap noloewdin
keywords: NOSOSCF
formula: C14H16ClN5O5S
InChI: InChI=1S/C14H16ClN5O5S/c1-9-16-12(19-14(17-9)24-2)18-13(21)20-26(22,23)11-6-4-3-5-10(11)25-8-7-15/h3-6,18,20H,7-8H2,1-2H3
42 atoms
Cl -0.371412 -3.563842 -0.725712
S  -1.742969 1.372798 -1.424804
O  -0.974944 -0.753892 0.440843
O  -1.675358 0.276048 -2.37441
O  -2.286068 2.643897 -1.862235
O  -0.594979 3.145155 0.642339
O  2.87593 -1.525677 -1.718873
N  -0.157191 1.589482 -0.953456
N  1.380706 2.059556 0.732629
N  3.209598 0.876039 1.407289
N  2.114421 0.296897 -0.589699
N  3.945425 -0.97489 0.152707
C  -2.604908 0.868634 0.031607
C  -2.144667 -0.211583 0.801549
C  -3.783146 1.530548 0.351555
C  -2.908351 -0.614184 1.894094
C  -4.530657 1.120033 1.440606
C  -4.087419 0.047727 2.199999
C  -0.327288 -1.709516 1.26954
C  0.151084 2.318121 0.162812
C  -0.754905 -3.1224 0.972086
C  2.261096 1.035044 0.500595
C  4.036359 -0.142773 1.181039
C  2.966853 -0.707909 -0.69891
C  5.149625 -0.344517 2.142698
C  1.853334 -1.308595 -2.694815
H  -4.119097 2.366823 -0.244914
H  -2.603961 -1.444308 2.51598
H  0.506573 0.853938 -1.23266
H  -5.448561 1.632335 1.691328
H  -4.66402 -0.286336 3.052331
H  0.739571 -1.592974 1.08208
H  -0.492071 -1.499066 2.329567
H  1.577167 2.613204 1.558151
H  -1.82194 -3.280712 1.115528
H  -0.21021 -3.803676 1.622978
H  5.532469 -1.360617 2.100489
H  5.967676 0.333594 1.888667
H  4.838952 -0.111057 3.158819
H  1.940649 -2.132936 -3.396513
H  0.860306 -1.321365 -2.248146
H  2.00738 -0.368102 -3.222892
elementType: Cl S O N C H
totalener: -2051.60843853 hartree
nucrepener: 2951.41365529 hartree
electener: -5003.02209381 hartree
oneelecener: -8685.41079443 hartree
twoeener: 3682.38870062 hartree
cpcmener: -0.06448316 hartree
kineticenergy: 2045.18448024 hartree
xcener: -151.014692039074 hartree
chargesum: 0.0000000
charge: -0.187432 0.893084 -0.317320 -0.524997 -0.516158 -0.472791 -0.273562 -0.205353 -0.134477 -0.406574 -0.420237 -0.374327 -0.173412 0.377939 -0.090930 -0.198181 -0.194199 -0.142433 -0.002863 0.364724 -0.060587 0.391657 0.338007 0.450597 -0.241718 -0.108363 0.154472 0.140784 0.229149 0.164709 0.166419 0.113744 0.130445 0.196275 0.128794 0.137876 0.098483 0.116682 0.102685 0.142481 0.073275 0.133633
qa: -0.1874 0.8931 -0.3173 -0.5250 -0.5162 -0.4728 -0.2736 -0.2054 -0.1345 -0.4066 -0.4202 -0.3743 -0.1734 0.3779 -0.0909 -0.1982 -0.1942 -0.1424 -0.0029 0.3647 -0.0606 0.3917 0.3380 0.4506 -0.2417 -0.1084 0.1545 0.1408 0.2291 0.1647 0.1664 0.1137 0.1304 0.1963 0.1288 0.1379 0.0985 0.1167 0.1027 0.1425 0.0733 0.1336
va: 1.0921 5.8031 2.0741 1.9563 1.9748 2.0340 2.1295 3.0778 3.2052 3.0107 2.9372 3.0012 3.7757 3.8217 3.9484 3.8956 3.9468 3.9251 3.8659 4.4127 3.9723 4.2242 3.9451 4.2421 3.9333 3.8353 1.0133 1.0120 1.0522 0.9883 0.9864 1.0087 1.0013 1.0154 1.0063 1.0054 1.0149 0.9987 1.0098 0.9940 1.0116 0.9949
dispcorr: -0.026609937 hartree
energy: -2051.635048462459
dipole: 5.46222 -4.37333 1.08889 -4.26344 2.14372 -2.11972 12.40899 -8.74132 3.66767
magnitude: 4.37387 au
magnitude: 11.11748 debye
