program: Orca
programVersion: 5.0.2
elementType: Cl S O O O O O N N N N N C C C C C C C C C C C C C C H H H H H H H H H H H H H H H H
charge: 0
multiplicity: 1
keywords: wb97x-d3
keywords: def2-TZVPP
keywords: def2/J RIJCOSX
keywords: DEFGRID2
keywords: scfconv7
keywords: smallprint printgap noloewdin
keywords: NOSOSCF
formula: C14H16ClN5O5S
InChI: InChI=1S/C14H16ClN5O5S/c1-9-16-12(19-14(17-9)24-2)18-13(21)20-26(22,23)11-6-4-3-5-10(11)25-8-7-15/h3-6,18,20H,7-8H2,1-2H3
42 atoms
Cl -0.014497 -1.250735 2.171566
S  -1.643312 1.302532 -1.513545
O  -1.567661 -1.403021 -0.44828
O  -1.522694 0.439441 -2.673837
O  -2.001918 2.692929 -1.714233
O  -0.648691 2.576292 0.956776
O  3.156034 -1.430294 -2.017393
N  -0.137805 1.231162 -0.798862
N  1.407833 1.656835 0.892851
N  3.406138 0.650623 1.338448
N  2.246804 0.129123 -0.636581
N  4.295815 -0.922032 -0.1726
C  -2.736705 0.612268 -0.318287
C  -2.567017 -0.711351 0.115513
C  -3.760753 1.411803 0.175139
C  -3.453776 -1.20416 1.070035
C  -4.639784 0.903351 1.111444
C  -4.474355 -0.402199 1.55193
C  -1.106841 -2.636672 0.08507
C  0.142429 1.861484 0.378807
C  0.175268 -2.452449 0.852272
C  2.381694 0.775014 0.512962
C  4.342045 -0.211686 0.946238
C  3.221138 -0.717074 -0.919167
C  5.524006 -0.372154 1.830084
C  1.993777 -1.31914 -2.844383
H  -3.870493 2.430194 -0.168958
H  -3.37051 -2.212343 1.4480
H  0.555196 0.578443 -1.185035
H  -5.439345 1.519962 1.496216
H  -5.151663 -0.813298 2.288359
H  -1.856628 -3.137935 0.692855
H  -0.895112 -3.286074 -0.765267
H  1.567839 2.115565 1.781251
H  0.979694 -2.101749 0.212804
H  0.470639 -3.399551 1.29817
H  6.146338 0.522997 1.772835
H  5.214728 -0.480065 2.868677
H  6.12622 -1.228589 1.541009
H  1.092812 -1.609506 -2.303098
H  1.878218 -0.309928 -3.237465
H  2.15492 -2.00883 -3.6676
elementType: Cl S O N C H
totalener: -2051.60799527 hartree
nucrepener: 2980.33942353 hartree
electener: -5031.94741880 hartree
oneelecener: -8743.78098410 hartree
twoeener: 3711.83356530 hartree
cpcmener: -0.06286849 hartree
kineticenergy: 2045.21851175 hartree
xcener: -151.025231837123 hartree
chargesum: 0.0000000
charge: -0.179261 0.889222 -0.324778 -0.525957 -0.516959 -0.480766 -0.278460 -0.196404 -0.123351 -0.401932 -0.422668 -0.372457 -0.086711 0.241614 -0.091833 -0.186879 -0.193407 -0.112540 -0.016743 0.358926 -0.026104 0.352784 0.338317 0.460847 -0.240500 -0.105703 0.154500 0.146940 0.229908 0.165110 0.166492 0.132875 0.125541 0.197442 0.100817 0.144407 0.113866 0.105349 0.096484 0.100105 0.122707 0.139157
qa: -0.1793 0.8892 -0.3248 -0.5260 -0.5170 -0.4808 -0.2785 -0.1964 -0.1234 -0.4019 -0.4227 -0.3725 -0.0867 0.2416 -0.0918 -0.1869 -0.1934 -0.1125 -0.0167 0.3589 -0.0261 0.3528 0.3383 0.4608 -0.2405 -0.1057 0.1545 0.1469 0.2299 0.1651 0.1665 0.1329 0.1255 0.1974 0.1008 0.1444 0.1139 0.1053 0.0965 0.1001 0.1227 0.1392
va: 1.1152 5.8191 2.0637 1.9579 1.9781 2.0256 2.1306 3.0658 3.1853 3.0061 2.9170 3.0113 3.7124 3.9150 3.9393 3.8819 3.9297 3.8905 3.9153 4.4207 3.9524 4.2693 3.9466 4.2196 3.9328 3.8402 1.0137 1.0064 1.0454 0.9885 0.9855 0.9979 0.9963 1.0149 1.0121 1.0105 1.0004 1.0068 1.0171 0.9914 0.9932 0.9957
dispcorr: -0.027646258 hartree
energy: -2051.635641525425
dipole: 5.05044 -4.17609 0.87435 -11.39657 7.73367 -3.66291 0.81241 0.61519 1.42760
magnitude: 4.02733 au
magnitude: 10.23667 debye
