program: Orca
programVersion: 5.0.2
elementType: Cl S O O O O O N N N N N C C C C C C C C C C C C C C H H H H H H H H H H H H H H H H
charge: 0
multiplicity: 1
keywords: wb97x-d3
keywords: def2-TZVPP
keywords: def2/J RIJCOSX
keywords: DEFGRID2
keywords: scfconv7
keywords: smallprint printgap noloewdin
keywords: NOSOSCF
formula: C14H16ClN5O5S
InChI: InChI=1S/C14H16ClN5O5S/c1-9-16-12(19-14(17-9)24-2)18-13(21)20-26(22,23)11-6-4-3-5-10(11)25-8-7-15/h3-6,18,20H,7-8H2,1-2H3
42 atoms
Cl 1.472538 2.207521 1.329995
S  -1.890993 -0.26595 -1.545557
O  -1.495105 1.603001 0.668501
O  -2.465143 -1.303564 -2.378156
O  -1.529367 1.007524 -2.138284
O  -1.322378 -2.692237 0.05877
O  3.498691 1.021859 -1.493163
N  -0.461323 -0.820074 -0.893916
N  0.890163 -2.313294 0.274107
N  3.119101 -2.215751 0.748168
N  2.148677 -0.599421 -0.652435
N  4.437839 -0.482533 -0.144017
C  -2.950735 -0.028037 -0.160979
C  -2.643686 0.937277 0.809466
C  -4.112288 -0.78381 -0.081091
C  -3.53936 1.127735 1.858443
C  -4.99499 -0.582912 0.965168
C  -4.700349 0.372908 1.925731
C  -1.207132 2.672118 1.554774
C  -0.371964 -1.983874 -0.185837
C  0.07655 3.3182 1.123324
C  2.090976 -1.680835 0.111155
C  4.273628 -1.573033 0.591253
C  3.343785 -0.045193 -0.749946
C  5.462724 -2.143731 1.278427
C  2.378215 1.517706 -2.230404
H  -4.331693 -1.526659 -0.835114
H  -3.344389 1.860021 2.629414
H  0.389647 -0.264085 -1.04564
H  -5.901568 -1.168483 1.027342
H  -5.382602 0.53922 2.749047
H  -1.997406 3.429852 1.510538
H  -1.130448 2.316772 2.586212
H  0.917192 -3.152774 0.840988
H  0.260686 4.193426 1.741343
H  0.045842 3.625341 0.079929
H  5.7844 -3.050298 0.761063
H  6.292188 -1.441358 1.285038
H  5.217167 -2.429928 2.300382
H  2.749898 2.378203 -2.780616
H  2.005333 0.774325 -2.935318
H  1.572002 1.835561 -1.570407
elementType: Cl S O N C H
totalener: -2051.61365257 hartree
nucrepener: 2912.87535456 hartree
electener: -4964.48900714 hartree
oneelecener: -8609.50514402 hartree
twoeener: 3645.01613689 hartree
cpcmener: -0.04861791 hartree
kineticenergy: 2045.21131969 hartree
xcener: -151.018811655281 hartree
chargesum: -0.0000000
charge: -0.183584 0.882282 -0.304753 -0.502324 -0.514253 -0.459182 -0.265310 -0.203114 -0.136353 -0.412988 -0.415774 -0.362385 -0.172177 0.365624 -0.066017 -0.221244 -0.195223 -0.125088 0.011486 0.376555 -0.082650 0.393178 0.325373 0.428065 -0.238310 -0.106124 0.151269 0.141817 0.216952 0.160712 0.162865 0.121608 0.112748 0.192232 0.139176 0.122380 0.112037 0.097449 0.103877 0.137847 0.125303 0.086022
qa: -0.1836 0.8823 -0.3048 -0.5023 -0.5143 -0.4592 -0.2653 -0.2031 -0.1364 -0.4130 -0.4158 -0.3624 -0.1722 0.3656 -0.0660 -0.2212 -0.1952 -0.1251 0.0115 0.3766 -0.0827 0.3932 0.3254 0.4281 -0.2383 -0.1061 0.1513 0.1418 0.2170 0.1607 0.1629 0.1216 0.1127 0.1922 0.1392 0.1224 0.1120 0.0974 0.1039 0.1378 0.1253 0.0860
va: 1.1040 5.8341 2.1093 1.9978 1.9751 2.0608 2.1371 3.0755 3.1994 3.0125 2.9272 3.0121 3.8044 3.8386 3.9121 3.9034 3.9476 3.9289 3.8586 4.4081 4.0116 4.2352 3.9628 4.2539 3.9308 3.8403 1.0162 1.0075 1.0537 0.9898 0.9875 0.9918 0.9965 1.0186 1.0043 1.0020 1.0008 1.0165 1.0073 0.9967 0.9944 1.0010
dispcorr: -0.024519193 hartree
energy: -2051.638171766006
dipole: 1.00659 -0.95585 0.05074 4.59315 -2.59476 1.99840 6.21367 -3.63047 2.58321
magnitude: 3.26636 au
magnitude: 8.30243 debye
