program: Orca
programVersion: 5.0.2
elementType: Cl S O O O O O N N N N N C C C C C C C C C C C C C C H H H H H H H H H H H H H H H H
charge: 0
multiplicity: 1
keywords: wb97x-d3
keywords: def2-TZVPP
keywords: def2/J RIJCOSX
keywords: DEFGRID2
keywords: scfconv7
keywords: smallprint printgap noloewdin
keywords: NOSOSCF
formula: C14H16ClN5O5S
InChI: InChI=1S/C14H16ClN5O5S/c1-9-16-12(19-14(17-9)24-2)18-13(21)20-26(22,23)11-6-4-3-5-10(11)25-8-7-15/h3-6,18,20H,7-8H2,1-2H3
42 atoms
Cl 0.316985 -3.995402 1.951493
S  -1.44362 2.22329 0.978139
O  -1.638258 -0.658993 1.238336
O  -1.721274 3.586783 0.57782
O  -1.057915 1.950162 2.348306
O  -1.079247 2.11496 -1.947626
O  4.774046 -1.253217 -2.544866
N  -0.166611 1.637764 0.075938
N  0.898174 1.035592 -1.907119
N  2.101725 0.257975 -0.073335
N  2.832202 -0.099548 -2.278845
N  4.092417 -0.914933 -0.460419
C  -2.812174 1.217042 0.50726
C  -2.765811 -0.168361 0.718772
C  -3.931579 1.820908 -0.046102
C  -3.871317 -0.934609 0.363695
C  -5.028935 1.049934 -0.389379
C  -4.988851 -0.320667 -0.181932
C  -1.458648 -2.063095 1.350139
C  -0.18401 1.635475 -1.288708
C  -0.019754 -2.246277 1.777615
C  1.977296 0.378747 -1.387066
C  3.180214 -0.404329 0.345163
C  3.864757 -0.734006 -1.756891
C  3.351935 -0.601318 1.808882
C  4.617568 -1.133098 -3.958155
H  -3.949462 2.889071 -0.211677
H  -3.874765 -2.006289 0.509604
H  0.592059 1.141719 0.562303
H  -5.903776 1.51702 -0.819561
H  -5.840962 -0.931855 -0.449519
H  -2.142676 -2.482676 2.092768
H  -1.634796 -2.554437 0.389252
H  0.864291 1.073496 -2.919014
H  0.177672 -1.771064 2.736579
H  0.662313 -1.850069 1.029007
H  3.217184 -1.656052 2.057286
H  4.362007 -0.329634 2.114598
H  2.633986 -0.016024 2.377496
H  4.629433 -0.090309 -4.274708
H  5.470011 -1.649539 -4.390881
H  3.697394 -1.605761 -4.300944
elementType: Cl S O N C H
totalener: -2051.61379012 hartree
nucrepener: 2832.80639944 hartree
electener: -4884.42018956 hartree
oneelecener: -8447.93545606 hartree
twoeener: 3563.51526650 hartree
cpcmener: -0.04881208 hartree
kineticenergy: 2045.19885956 hartree
xcener: -151.014819085637 hartree
chargesum: 0.0000000
charge: -0.178046 0.881437 -0.314748 -0.500656 -0.512086 -0.457443 -0.270233 -0.206776 -0.140587 -0.428579 -0.420659 -0.376490 -0.165343 0.355850 -0.073254 -0.220734 -0.194408 -0.125505 0.011787 0.374831 -0.068693 0.414994 0.333364 0.454997 -0.266748 -0.117467 0.151912 0.143415 0.220392 0.160131 0.163037 0.122916 0.112809 0.192933 0.133631 0.105303 0.109681 0.123799 0.105871 0.117249 0.131267 0.116848
qa: -0.1780 0.8814 -0.3147 -0.5007 -0.5121 -0.4574 -0.2702 -0.2068 -0.1406 -0.4286 -0.4207 -0.3765 -0.1653 0.3559 -0.0733 -0.2207 -0.1944 -0.1255 0.0118 0.3748 -0.0687 0.4150 0.3334 0.4550 -0.2667 -0.1175 0.1519 0.1434 0.2204 0.1601 0.1630 0.1229 0.1128 0.1929 0.1336 0.1053 0.1097 0.1238 0.1059 0.1172 0.1313 0.1168
va: 1.1037 5.8407 2.0979 1.9978 1.9795 2.0597 2.1353 3.0748 3.2043 2.9812 2.9598 3.0027 3.8065 3.8377 3.9298 3.9146 3.9472 3.9273 3.8863 4.4092 4.0026 4.1929 3.8915 4.2576 3.9413 3.8505 1.0147 1.0081 1.0551 0.9899 0.9873 0.9926 0.9946 1.0166 1.0001 1.0095 1.0034 1.0104 1.0097 0.9947 0.9944 0.9949
dispcorr: -0.023358329 hartree
energy: -2051.637148445156
dipole: 2.56843 -2.28271 0.28572 -4.55833 1.91104 -2.64729 -5.99557 4.44486 -1.55071
magnitude: 3.08131 au
magnitude: 7.83208 debye
