program: Orca
programVersion: 5.0.2
elementType: Cl S O O O O O N N N N N C C C C C C C C C C C C C C H H H H H H H H H H H H H H H H
charge: 0
multiplicity: 1
keywords: wb97x-d3
keywords: def2-TZVPP
keywords: def2/J RIJCOSX
keywords: DEFGRID2
keywords: scfconv7
keywords: smallprint printgap noloewdin
keywords: NOSOSCF
formula: C14H16ClN5O5S
InChI: InChI=1S/C14H16ClN5O5S/c1-9-16-12(19-14(17-9)24-2)18-13(21)20-26(22,23)11-6-4-3-5-10(11)25-8-7-15/h3-6,18,20H,7-8H2,1-2H3
42 atoms
Cl -0.634329 -2.411527 -4.072612
S  -1.423922 -0.091465 2.051645
O  -1.730073 -0.463914 -0.845345
O  -1.617464 0.420396 3.385197
O  -1.345797 -1.514787 1.807616
O  -0.336999 2.708841 1.722901
O  3.276921 -2.141748 -0.082252
N  0.023994 0.478606 1.430458
N  1.630299 2.049656 0.83066
N  3.694271 1.793997 -0.092795
N  2.385657 -0.103187 0.377249
N  4.520657 -0.359096 -0.572813
C  -2.630604 0.658349 0.998512
C  -2.678528 0.352797 -0.366993
C  -3.540054 1.537549 1.561726
C  -3.675687 0.929556 -1.14544
C  -4.530669 2.107265 0.779315
C  -4.592662 1.79542 -0.567411
C  -1.784272 -0.877524 -2.192006
C  0.364379 1.798521 1.372328
C  -0.641614 -1.851179 -2.381679
C  2.595469 1.209727 0.3596
C  4.622989 0.96176 -0.552714
C  3.38695 -0.835096 -0.087301
C  5.889243 1.563763 -1.057424
C  2.127075 -2.734723 0.507306
H  -3.465026 1.776552 2.612695
H  -3.747224 0.719296 -2.203355
H  0.681991 -0.214538 1.06878
H  -5.240852 2.792511 1.219271
H  -5.361118 2.234283 -1.18993
H  -2.735532 -1.370811 -2.415811
H  -1.668707 -0.027947 -2.873551
H  1.867193 3.030313 0.785979
H  -0.757661 -2.718413 -1.733797
H  0.316736 -1.37699 -2.176543
H  5.700519 2.523535 -1.532545
H  6.563001 1.74296 -0.217049
H  6.38918 0.890272 -1.748117
H  2.024114 -2.463454 1.558933
H  1.209063 -2.460577 -0.014143
H  2.276995 -3.807725 0.426606
totalener: -2051.57355809 hartree
nucrepener: 2835.89156060 hartree
electener: -4887.46511868 hartree
oneelecener: -8453.81628693 hartree
twoeener: 3566.35116825 hartree
kineticenergy: 2045.27859563 hartree
xcener: -151.019813990309 hartree
chargesum: 0.0000000
charge: -0.129014 0.859058 -0.290147 -0.435199 -0.465194 -0.358535 -0.231957 -0.215166 -0.165598 -0.371601 -0.440180 -0.302869 -0.212568 0.356402 -0.015517 -0.207847 -0.155086 -0.113831 -0.010882 0.336946 -0.084826 0.387920 0.262866 0.408337 -0.227468 -0.114860 0.140709 0.116308 0.191611 0.130714 0.131743 0.105326 0.099138 0.174147 0.120116 0.094938 0.100432 0.098693 0.105293 0.121670 0.074878 0.131097
qa: -0.1290 0.8591 -0.2901 -0.4352 -0.4652 -0.3585 -0.2320 -0.2152 -0.1656 -0.3716 -0.4402 -0.3029 -0.2126 0.3564 -0.0155 -0.2078 -0.1551 -0.1138 -0.0109 0.3369 -0.0848 0.3879 0.2629 0.4083 -0.2275 -0.1149 0.1407 0.1163 0.1916 0.1307 0.1317 0.1053 0.0991 0.1741 0.1201 0.0949 0.1004 0.0987 0.1053 0.1217 0.0749 0.1311
va: 1.1552 5.8577 2.1160 2.0736 2.0302 2.1615 2.1679 3.0757 3.1817 3.0194 2.9387 3.0216 3.9588 3.8274 3.9356 3.9526 3.9833 4.0042 3.8974 4.4155 4.0617 4.2103 4.0200 4.2564 3.9110 3.8755 1.0211 1.0156 1.0730 1.0006 0.9983 0.9951 0.9933 1.0332 0.9976 1.0093 1.0112 1.0046 1.0144 0.9974 0.9944 0.9979
dispcorr: -0.023095585 hartree
energy: -2051.596653671153
dipole: 4.10589 -3.95371 0.15218 3.39290 -3.02177 0.37114 -2.50851 1.06588 -1.44263
magnitude: 1.49736 au
magnitude: 3.80598 debye
