program: Orca
programVersion: 5.0.2
elementType: Cl S O O O O O N N N N N C C C C C C C C C C C C C C H H H H H H H H H H H H H H H H
charge: 0
multiplicity: 1
keywords: wb97x-d3
keywords: def2-TZVPP
keywords: def2/J RIJCOSX
keywords: DEFGRID2
keywords: scfconv7
keywords: smallprint printgap noloewdin
keywords: NOSOSCF
formula: C14H16ClN5O5S
InChI: InChI=1S/C14H16ClN5O5S/c1-9-16-12(19-14(17-9)24-2)18-13(21)20-26(22,23)11-6-4-3-5-10(11)25-8-7-15/h3-6,18,20H,7-8H2,1-2H3
42 atoms
Cl -2.38861 -4.55413 -0.813664
S  -1.434422 1.337185 -1.382496
O  -1.183528 -0.975409 0.425385
O  -1.345696 0.158835 -2.218988
O  -1.875153 2.595295 -1.927378
O  -0.273039 3.30727 0.56003
O  3.359731 -1.499728 -1.29742
N  0.114309 1.498038 -0.769454
N  1.784382 2.379067 0.592956
N  3.907157 1.670781 1.007606
N  2.517545 0.419196 -0.419538
N  4.701436 -0.321462 0.034755
C  -2.413773 0.993906 0.051625
C  -2.221832 -0.185827 0.772708
C  -3.3953 1.902959 0.416248
C  -3.059221 -0.456826 1.848016
C  -4.225801 1.622954 1.487057
C  -4.055609 0.442484 2.19304
C  -1.371374 -2.377031 0.38061
C  0.462781 2.453639 0.143987
C  -2.246596 -2.774354 -0.794406
C  2.761746 1.452663 0.376439
C  4.844593 0.754486 0.796846
C  3.520818 -0.437711 -0.5446
C  6.157336 0.930497 1.480628
C  2.120401 -1.684472 -1.966712
H  -3.505342 2.821439 -0.142164
H  -2.926494 -1.35517 2.435797
H  0.783042 0.751666 -0.972944
H  -4.995237 2.326532 1.771494
H  -4.697442 0.218756 3.034747
H  -0.376329 -2.805928 0.267071
H  -1.788137 -2.768977 1.312377
H  2.039604 3.116323 1.234126
H  -1.816467 -2.44779 -1.737857
H  -3.250231 -2.359897 -0.708776
H  6.235139 1.914001 1.93468
H  6.27013 0.174205 2.258874
H  6.972641 0.780576 0.774802
H  2.212884 -2.625633 -2.50066
H  1.285522 -1.745887 -1.267486
H  1.919312 -0.884747 -2.680397
totalener: -2051.57224294 hartree
nucrepener: 2837.13301017 hartree
electener: -4888.70525311 hartree
oneelecener: -8456.39237148 hartree
twoeener: 3567.68711837 hartree
kineticenergy: 2045.27992807 hartree
xcener: -151.019678074762 hartree
chargesum: 0.0000000
charge: -0.140808 0.876189 -0.317775 -0.483068 -0.431624 -0.356231 -0.233958 -0.215489 -0.166806 -0.367173 -0.434233 -0.311860 -0.097092 0.151250 -0.038885 -0.136942 -0.137429 -0.100893 -0.055068 0.337743 -0.060832 0.395266 0.265864 0.405471 -0.223347 -0.116021 0.142968 0.122334 0.202214 0.132468 0.132961 0.110813 0.113490 0.174009 0.121220 0.116532 0.100800 0.097437 0.101833 0.131334 0.070530 0.122811
qa: -0.1408 0.8762 -0.3178 -0.4831 -0.4316 -0.3562 -0.2340 -0.2155 -0.1668 -0.3672 -0.4342 -0.3119 -0.0971 0.1512 -0.0389 -0.1369 -0.1374 -0.1009 -0.0551 0.3377 -0.0608 0.3953 0.2659 0.4055 -0.2233 -0.1160 0.1430 0.1223 0.2022 0.1325 0.1330 0.1108 0.1135 0.1740 0.1212 0.1165 0.1008 0.0974 0.1018 0.1313 0.0705 0.1228
va: 1.1503 5.8414 2.0417 2.0060 2.0792 2.1618 2.1712 3.0857 3.1874 3.0275 2.9588 3.0116 3.8757 3.9638 3.9649 3.9456 3.9567 3.9657 3.9208 4.4151 3.9903 4.1958 4.0192 4.2699 3.9058 3.8894 1.0227 1.0083 1.0632 0.9999 0.9973 0.9950 1.0058 1.0334 1.0147 1.0072 1.0167 1.0066 1.0098 0.9978 0.9912 0.9961
dispcorr: -0.023894719 hartree
energy: -2051.596137657524
dipole: 7.47516 -7.11287 0.36229 0.04413 -0.73342 -0.68929 7.59926 -6.12089 1.47837
magnitude: 1.67092 au
magnitude: 4.24713 debye
