program: Orca
programVersion: 5.0.2
elementType: Cl S O O O O O N N N N N C C C C C C C C C C C C C C H H H H H H H H H H H H H H H H
charge: 0
multiplicity: 1
keywords: wb97x-d3
keywords: def2-TZVPP
keywords: def2/J RIJCOSX
keywords: DEFGRID2
keywords: scfconv7
keywords: smallprint printgap noloewdin
keywords: NOSOSCF
formula: C14H16ClN5O5S
InChI: InChI=1S/C14H16ClN5O5S/c1-9-16-12(19-14(17-9)24-2)18-13(21)20-26(22,23)11-6-4-3-5-10(11)25-8-7-15/h3-6,18,20H,7-8H2,1-2H3
42 atoms
Cl 0.318837 -3.054766 3.366117
S  -1.472802 2.119766 -0.335572
O  -1.575426 -0.392558 1.193699
O  -1.822186 3.123164 -1.308903
O  -1.032502 2.491178 0.990674
O  -1.073036 0.566509 -2.910754
O  3.598709 0.594168 1.343009
N  -0.195232 1.198429 -0.90388
N  0.996124 -0.15589 -2.370543
N  3.058046 -1.101022 -2.192476
N  2.243269 0.251259 -0.44876
N  4.374903 -0.724133 -0.27619
C  -2.815921 0.970899 -0.243535
C  -2.737892 -0.168119 0.566122
C  -3.968617 1.255863 -0.956169
C  -3.845183 -1.004074 0.654167
C  -5.069518 0.421209 -0.858864
C  -4.999753 -0.700724 -0.052436
C  -1.408202 -1.576922 1.939834
C  -0.177358 0.562241 -2.110625
C  0.018242 -1.562433 2.443463
C  2.131597 -0.333779 -1.637329
C  4.156749 -1.268734 -1.46494
C  3.39084 0.031317 0.177336
C  5.219698 -2.154668 -2.017324
C  2.628697 1.498138 1.856768
H  -3.99785 2.129949 -1.590457
H  -3.824348 -1.892614 1.269341
H  0.611152 1.096292 -0.284855
H  -5.969008 0.645551 -1.413893
H  -5.852509 -1.361202 0.031644
H  -2.101952 -1.61557 2.785929
H  -1.575146 -2.462718 1.317782
H  0.994187 -0.628589 -3.262993
H  0.193095 -0.713089 3.101546
H  0.724985 -1.523008 1.616285
H  5.153734 -2.214438 -3.100364
H  6.204445 -1.806108 -1.715793
H  5.093792 -3.162403 -1.616531
H  3.024884 1.842599 2.80729
H  2.482759 2.353295 1.196427
H  1.663649 1.018848 2.023144
totalener: -2051.57351406 hartree
nucrepener: 2851.96906343 hartree
electener: -4903.54257748 hartree
oneelecener: -8485.86966361 hartree
twoeener: 3582.32708613 hartree
kineticenergy: 2045.28678456 hartree
xcener: -151.021420791337 hartree
chargesum: -0.0000000
charge: -0.128858 0.858788 -0.292651 -0.435276 -0.463686 -0.354061 -0.230345 -0.214371 -0.166019 -0.368244 -0.443893 -0.304347 -0.196203 0.354161 -0.028325 -0.207696 -0.155904 -0.112844 -0.009934 0.333267 -0.086261 0.389663 0.263954 0.402621 -0.226052 -0.116926 0.141970 0.116058 0.190669 0.130629 0.131628 0.105105 0.101073 0.174185 0.119558 0.093401 0.101421 0.104373 0.097897 0.130647 0.121916 0.078913
qa: -0.1289 0.8588 -0.2927 -0.4353 -0.4637 -0.3541 -0.2303 -0.2144 -0.1660 -0.3682 -0.4439 -0.3043 -0.1962 0.3542 -0.0283 -0.2077 -0.1559 -0.1128 -0.0099 0.3333 -0.0863 0.3897 0.2640 0.4026 -0.2261 -0.1169 0.1420 0.1161 0.1907 0.1306 0.1316 0.1051 0.1011 0.1742 0.1196 0.0934 0.1014 0.1044 0.0979 0.1306 0.1219 0.0789
va: 1.1559 5.8551 2.1123 2.0727 2.0304 2.1657 2.1674 3.0750 3.1804 3.0237 2.9301 3.0179 3.9510 3.8265 3.9510 3.9505 3.9845 4.0023 3.8955 4.4216 4.0622 4.2005 4.0185 4.2628 3.9093 3.8721 1.0207 1.0157 1.0744 1.0008 0.9984 0.9936 0.9957 1.0331 0.9963 1.0136 1.0137 1.0125 1.0052 0.9978 0.9970 0.9959
dispcorr: -0.023642875 hartree
energy: -2051.597156932224
dipole: 2.52053 -2.48898 0.03155 -3.56709 2.07859 -1.48850 -1.36166 1.72591 0.36425
magnitude: 1.53275 au
magnitude: 3.89593 debye
