program: Orca
programVersion: 5.0.2
elementType: Cl S O O O O O N N N N N C C C C C C C C C C C C C C H H H H H H H H H H H H H H H H
charge: 0
multiplicity: 1
keywords: wb97x-d3
keywords: def2-TZVPP
keywords: def2/J RIJCOSX
keywords: DEFGRID2
keywords: scfconv7
keywords: smallprint printgap noloewdin
keywords: NOSOSCF
formula: C14H16ClN5O5S
InChI: InChI=1S/C14H16ClN5O5S/c1-9-16-12(19-14(17-9)24-2)18-13(21)20-26(22,23)11-6-4-3-5-10(11)25-8-7-15/h3-6,18,20H,7-8H2,1-2H3
42 atoms
Cl 0.756984 -1.745966 4.055823
S  -1.571669 1.977913 -0.881968
O  -1.398247 -0.020698 1.263232
O  -2.036362 2.660324 -2.062733
O  -1.085174 2.716458 0.262516
O  -1.298482 -0.286711 -2.861694
O  3.603268 1.061269 0.8675
N  -0.276544 0.991559 -1.277393
N  0.808617 -0.822579 -2.249869
N  2.826471 -1.772553 -1.784882
N  2.164543 0.177254 -0.649197
N  4.24214 -0.809365 -0.165158
C  -2.825594 0.836717 -0.378726
C  -2.616078 -0.02789 0.702321
C  -4.038511 0.859574 -1.045578
C  -3.657215 -0.854408 1.108327
C  -5.07265 0.036353 -0.63187
C  -4.8751 -0.80974 0.44497
C  -1.119717 -0.900289 2.329724
C  -0.344233 -0.030561 -2.178289
C  0.322404 -0.653423 2.718464
C  1.968648 -0.795075 -1.534191
C  3.943732 -1.735756 -1.065134
C  3.321981 0.126282 -0.007106
C  4.95039 -2.807179 -1.308046
C  2.699178 2.148484 1.026676
H  -4.166511 1.519671 -1.891522
H  -3.535987 -1.53631 1.93828
H  0.565363 1.082511 -0.705966
H  -6.020256 0.055747 -1.150766
H  -5.675082 -1.457259 0.778398
H  -1.774532 -0.706851 3.185527
H  -1.251645 -1.943998 2.024982
H  0.738609 -1.584242 -2.909356
H  0.467647 0.371576 3.054758
H  0.9924 -0.852375 1.88402
H  5.618571 -2.499278 -2.115066
H  5.557606 -2.973435 -0.422204
H  4.467709 -3.731137 -1.616745
H  1.717406 1.824738 1.374772
H  3.148498 2.793835 1.775571
H  2.573333 2.706905 0.098395
totalener: -2051.57299959 hartree
nucrepener: 2870.12004198 hartree
electener: -4921.69304157 hartree
oneelecener: -8522.14781217 hartree
twoeener: 3600.45477059 hartree
kineticenergy: 2045.28225810 hartree
xcener: -151.020609494476 hartree
chargesum: 0.0000000
charge: -0.129307 0.860569 -0.293914 -0.435835 -0.464486 -0.353978 -0.229677 -0.211143 -0.165134 -0.368133 -0.441831 -0.301552 -0.204287 0.364703 -0.029503 -0.209034 -0.154503 -0.114257 -0.014079 0.328351 -0.085604 0.385786 0.266214 0.399878 -0.229525 -0.118706 0.141261 0.117103 0.191782 0.130528 0.131521 0.106641 0.102431 0.174732 0.120595 0.092864 0.099079 0.105765 0.100832 0.081241 0.132176 0.120436
qa: -0.1293 0.8606 -0.2939 -0.4358 -0.4645 -0.3540 -0.2297 -0.2111 -0.1651 -0.3681 -0.4418 -0.3016 -0.2043 0.3647 -0.0295 -0.2090 -0.1545 -0.1143 -0.0141 0.3284 -0.0856 0.3858 0.2662 0.3999 -0.2295 -0.1187 0.1413 0.1171 0.1918 0.1305 0.1315 0.1066 0.1024 0.1747 0.1206 0.0929 0.0991 0.1058 0.1008 0.0812 0.1322 0.1204
va: 1.1554 5.8514 2.1106 2.0714 2.0302 2.1640 2.1659 3.0750 3.1812 3.0216 2.9261 3.0190 3.9471 3.8145 3.9569 3.9543 3.9868 4.0049 3.8993 4.4219 4.0658 4.2071 4.0138 4.2578 3.9116 3.8710 1.0206 1.0154 1.0753 1.0006 0.9984 0.9942 0.9944 1.0327 0.9976 1.0128 1.0044 1.0133 1.0122 0.9972 0.9974 0.9956
dispcorr: -0.024253650 hartree
energy: -2051.597253243825
dipole: 2.49965 -2.31544 0.18421 -4.34081 3.00497 -1.33585 -0.40238 1.10178 0.69940
magnitude: 1.51907 au
magnitude: 3.86118 debye
