program: Orca
programVersion: 4.2.1
elementType: S S O O O O O O O O O N N N N N C C C C C C C C C C C C C C C C C H H H H H H H H H H H H H H H H H H H H H
charge: 0
multiplicity: 1
keywords: wb97x-d3
keywords: def2-TZVPP
keywords: def2/J RIJCOSX GRIDX6 NOFINALGRIDX
keywords: grid4 nofinalgrid
keywords: scfconv7
keywords: smallprint printgap noloewdin
keywords: NOSOSCF
formula: C17H21N5O9S2
InChI: InChI=1S/C17H21N5O9S2/c1-29-13-8-14(30-2)20-16(19-13)21-17(24)22-33(27,28)12-7-10(9-18-32(4,25)26)5-6-11(12)15(23)31-3/h5-8,18,21-22H,9H2,1-4H3
54 atoms
S  -0.11377 0.224194 -1.595528
S  5.49514 2.901726 -0.516658
O  0.65881 -0.283997 -2.708664
O  -1.100024 1.266074 -1.82092
O  -1.110717 3.249357 0.643371
O  5.819289 3.177327 0.87892
O  4.326126 3.567957 -1.081734
O  -1.721589 1.174614 1.222489
O  0.781581 -2.40893 -0.605702
O  -4.995551 -5.106098 1.734475
O  -5.291372 -0.861436 -0.114618
N  5.414305 1.247481 -0.663548
N  -0.982972 -1.011374 -0.911178
N  -1.25631 -3.088181 0.084955
N  -3.118027 -4.099683 0.905464
N  -3.273181 -1.936515 -0.025952
C  1.00151 0.774082 -0.334696
C  3.245889 0.883546 0.513105
C  4.702172 0.521808 0.388805
C  2.33474 0.41697 -0.42786
C  0.547125 1.617269 0.678777
C  2.796544 1.71653 1.527238
C  1.462077 2.086457 1.607273
C  -0.893002 1.971208 0.861278
C  6.888035 3.273388 -1.541564
C  -0.404793 -2.178516 -0.491009
C  -2.613207 -3.026268 0.326672
C  -2.451879 3.724944 0.813512
C  -4.420071 -4.068037 1.151817
C  -4.579442 -1.922667 0.223436
C  -5.228502 -2.985795 0.826032
C  -4.197219 -6.232208 2.091942
C  -4.632171 0.255976 -0.707424
H  4.809197 -0.5337 0.143361
H  5.21788 0.673582 1.334557
H  2.675381 -0.221737 -1.232107
H  3.489771 2.08709 2.270664
H  1.136145 2.738486 2.406442
H  5.099553 0.989318 -1.595499
H  -1.982165 -0.868003 -0.699975
H  6.69979 2.924306 -2.554907
H  7.776987 2.795773 -1.13883
H  7.013827 4.354925 -1.547845
H  -3.144914 3.191407 0.163238
H  -2.430951 4.773147 0.533206
H  -2.774376 3.630286 1.849755
H  -6.288697 -2.973177 1.031212
H  -4.879081 -6.936087 2.560724
H  -3.416228 -5.963781 2.802281
H  -3.745596 -6.699938 1.217838
H  -3.900418 0.68935 -0.026893
H  -4.15393 -0.009508 -1.650411
H  -5.411528 0.987005 -0.903652
H  -0.806786 -3.942405 0.386914
elementType: S O N C H
totalener: -2407.87432271 hartree
nucrepener: 4055.43469654 hartree
electener: -6463.30901925 hartree
twoeener: 4912.80965009 hartree
cpcmener: -0.07351149 hartree
kineticenergy: 2399.60895923 hartree
xcener: -185.882689879310 hartree
chargesum: 0.0000000
charge: 0.888725 0.828966 -0.504217 -0.515872 -0.267487 -0.556120 -0.546455 -0.437737 -0.488291 -0.300774 -0.300512 -0.220999 -0.200665 -0.136486 -0.426006 -0.426404 -0.136871 -0.067963 -0.033198 0.006272 0.064449 -0.103683 -0.172549 0.427439 -0.226504 0.385274 0.370483 -0.127157 0.420620 0.425753 -0.327429 -0.114189 -0.118161 0.134771 0.126717 0.130561 0.150696 0.152052 0.172588 0.220198 0.141353 0.136777 0.138247 0.114933 0.137263 0.126956 0.146491 0.132679 0.114174 0.114339 0.096579 0.115289 0.143154 0.191931
qa: 0.8887 0.8290 -0.5042 -0.5159 -0.2675 -0.5561 -0.5465 -0.4377 -0.4883 -0.3008 -0.3005 -0.2210 -0.2007 -0.1365 -0.4260 -0.4264 -0.1369 -0.0680 -0.0332 0.0063 0.0644 -0.1037 -0.1725 0.4274 -0.2265 0.3853 0.3705 -0.1272 0.4206 0.4258 -0.3274 -0.1142 -0.1182 0.1348 0.1267 0.1306 0.1507 0.1521 0.1726 0.2202 0.1414 0.1368 0.1382 0.1149 0.1373 0.1270 0.1465 0.1327 0.1142 0.1143 0.0966 0.1153 0.1432 0.1919
va: 5.8077 5.7197 1.9935 1.9705 2.1378 1.9012 1.8963 2.0547 2.0260 2.1200 2.1318 2.9944 3.0914 3.1831 2.9676 2.9752 3.8111 3.6467 3.8901 3.8364 3.7342 3.9246 4.0549 4.1114 3.8904 4.3995 4.2497 3.8568 4.0161 3.9799 3.9352 3.8456 3.8399 0.9962 1.0090 1.0388 1.0060 1.0034 1.0185 1.0540 1.0034 1.0106 1.0078 0.9908 0.9942 0.9920 1.0164 0.9933 0.9955 0.9954 1.0071 0.9949 0.9959 1.0172
dispcorr: -0.032338621 hartree
energy: -2407.906661326008
dipole: 0.35818 -0.20297 0.15521 1.50940 -2.63654 -1.12714 5.45631 -4.24527 1.21104
magnitude: 1.66167 au
magnitude: 4.22364 debye
