program: Orca
programVersion: 4.2.1
elementType: S S O O O O O O O O O N N N N N C C C C C C C C C C C C C C C C C H H H H H H H H H H H H H H H H H H H H H
charge: 0
multiplicity: 1
keywords: wb97x-d3
keywords: def2-TZVPP
keywords: def2/J RIJCOSX GRIDX6 NOFINALGRIDX
keywords: grid4 nofinalgrid
keywords: scfconv7
keywords: smallprint printgap noloewdin
keywords: NOSOSCF
formula: C17H21N5O9S2
InChI: InChI=1S/C17H21N5O9S2/c1-29-13-8-14(30-2)20-16(19-13)21-17(24)22-33(27,28)12-7-10(9-18-32(4,25)26)5-6-11(12)15(23)31-3/h5-8,18,21-22H,9H2,1-4H3
54 atoms
S  -0.257699 1.049236 1.327222
S  5.608624 2.722214 -0.7913
O  -1.233072 2.040413 0.909801
O  0.424593 1.20445 2.593276
O  -1.004293 2.451135 -2.257124
O  4.462369 3.623103 -0.848197
O  6.037311 2.099095 -2.038068
O  -1.647653 0.390627 -1.664919
O  0.649861 -1.702066 1.884839
O  -4.915855 -5.354649 0.544362
O  -5.326533 -0.747802 0.185846
N  5.393096 1.489411 0.302434
N  -1.106567 -0.376971 1.322158
N  -1.332088 -2.683566 1.440053
N  -3.116462 -4.019819 0.999894
N  -3.329532 -1.676813 0.806583
C  0.955098 0.879165 0.046903
C  3.253533 0.543057 -0.566567
C  4.683586 0.297641 -0.163584
C  2.267271 0.629892 0.409072
C  0.596682 1.069416 -1.286813
C  2.899902 0.728225 -1.895893
C  1.587244 0.996239 -2.253537
C  -0.816339 1.259903 -1.733136
C  6.960538 3.601272 -0.06217
C  -0.517486 -1.58653 1.572111
C  -2.655274 -2.784477 1.063167
C  -2.313094 2.749056 -2.757715
C  -4.385055 -4.147218 0.63693
C  -4.602071 -1.821767 0.448655
C  -5.203144 -3.063446 0.342062
C  -4.10733 -6.492715 0.832364
C  -4.716953 0.538479 0.272292
H  5.243828 -0.149778 -0.981736
H  4.723121 -0.411078 0.661971
H  2.532561 0.502473 1.449967
H  3.650746 0.66196 -2.67207
H  1.336725 1.136122 -3.296448
H  5.020321 1.848263 1.177447
H  -2.081658 -0.378141 0.988236
H  7.828765 2.951501 0.002018
H  6.676321 3.95138 0.928184
H  7.178365 4.456207 -0.700417
H  -2.582144 2.086877 -3.5792
H  -2.266367 3.772316 -3.115866
H  -3.061053 2.677365 -1.968539
H  -6.235372 -3.18133 0.047244
H  -3.756691 -6.487722 1.863821
H  -3.252492 -6.561226 0.160472
H  -4.750888 -7.354301 0.678722
H  -4.352034 0.746388 1.27828
H  -3.905598 0.642272 -0.447194
H  -5.499341 1.251448 0.028181
H  -0.872173 -3.565009 1.625578
elementType: S O N C H
totalener: -2407.87440918 hartree
nucrepener: 4052.61349563 hartree
electener: -6460.48790481 hartree
twoeener: 4909.90844705 hartree
cpcmener: -0.07306031 hartree
kineticenergy: 2399.61584158 hartree
xcener: -185.884195959536 hartree
chargesum: 0.0000000
charge: 0.891772 0.826267 -0.517247 -0.504244 -0.268073 -0.547914 -0.554490 -0.438453 -0.488094 -0.300838 -0.300312 -0.215144 -0.199986 -0.136944 -0.427238 -0.427118 -0.141330 -0.059554 -0.039388 0.011274 0.063202 -0.116415 -0.171770 0.431249 -0.223862 0.384664 0.370478 -0.125768 0.421253 0.425788 -0.327397 -0.116025 -0.111498 0.131256 0.132050 0.130566 0.153466 0.152012 0.170683 0.219014 0.135907 0.141196 0.138225 0.125109 0.137123 0.116125 0.147171 0.114658 0.114597 0.132833 0.116931 0.089580 0.142316 0.192337
qa: 0.8918 0.8263 -0.5172 -0.5042 -0.2681 -0.5479 -0.5545 -0.4385 -0.4881 -0.3008 -0.3003 -0.2151 -0.2000 -0.1369 -0.4272 -0.4271 -0.1413 -0.0596 -0.0394 0.0113 0.0632 -0.1164 -0.1718 0.4312 -0.2239 0.3847 0.3705 -0.1258 0.4213 0.4258 -0.3274 -0.1160 -0.1115 0.1313 0.1321 0.1306 0.1535 0.1520 0.1707 0.2190 0.1359 0.1412 0.1382 0.1251 0.1371 0.1161 0.1472 0.1147 0.1146 0.1328 0.1169 0.0896 0.1423 0.1923
va: 5.8053 5.7211 1.9699 1.9931 2.1392 1.8929 1.9029 2.0535 2.0260 2.1201 2.1321 2.9982 3.0905 3.1834 2.9680 2.9735 3.8056 3.6514 3.8977 3.8310 3.7378 3.9201 4.0617 4.1071 3.8897 4.3998 4.2491 3.8575 4.0138 3.9799 3.9328 3.8458 3.8416 1.0075 0.9969 1.0381 1.0059 1.0040 1.0196 1.0554 1.0109 1.0041 1.0077 0.9925 0.9943 0.9903 1.0161 0.9952 0.9952 0.9935 0.9946 1.0051 0.9960 1.0169
dispcorr: -0.032272978 hartree
energy: -2407.906682155021
dipole: 0.87391 -0.68255 0.19136 -1.50335 0.04747 -1.45588 -5.79221 5.33863 -0.45358
magnitude: 1.53686 au
magnitude: 3.90639 debye
