program: Orca
programVersion: 4.2.1
elementType: S S O O O O O O O O O N N N N N C C C C C C C C C C C C C C C C C H H H H H H H H H H H H H H H H H H H H H
charge: 0
multiplicity: 1
keywords: wb97x-d3
keywords: def2-TZVPP
keywords: def2/J RIJCOSX GRIDX6 NOFINALGRIDX
keywords: grid4 nofinalgrid
keywords: scfconv7
keywords: smallprint printgap noloewdin
keywords: NOSOSCF
formula: C17H21N5O9S2
InChI: InChI=1S/C17H21N5O9S2/c1-29-13-8-14(30-2)20-16(19-13)21-17(24)22-33(27,28)12-7-10(9-18-32(4,25)26)5-6-11(12)15(23)31-3/h5-8,18,21-22H,9H2,1-4H3
54 atoms
S  0.020622 0.749049 1.078614
S  5.425991 2.535971 0.608025
O  -1.024568 1.75503 1.13856
O  0.927557 0.594349 2.196849
O  -1.420919 3.018398 -1.861621
O  4.748375 3.474514 -0.277449
O  6.837774 2.739432 0.908913
O  -1.843812 0.829803 -1.663453
O  1.039638 -1.997194 0.706908
O  -4.700962 -5.5923 0.188344
O  -5.163742 -0.991948 0.573091
N  5.207898 1.020316 -0.020281
N  -0.798978 -0.670806 0.834246
N  -0.99258 -2.960372 0.516912
N  -2.837614 -4.277687 0.355445
N  -3.080143 -1.937468 0.545774
C  0.982107 1.029625 -0.383538
C  3.160486 1.142052 -1.388398
C  4.638493 0.871864 -1.350788
C  2.344974 0.801156 -0.316387
C  0.394699 1.600054 -1.512316
C  2.583535 1.720817 -2.508986
C  1.21701 1.947275 -2.573283
C  -1.080794 1.762478 -1.665139
C  4.555561 2.483938 2.149025
C  -0.168305 -1.876097 0.690664
C  -2.368708 -3.049195 0.473531
C  -2.811606 3.294259 -2.06832
C  -4.157405 -4.392616 0.306408
C  -4.402504 -2.070174 0.498729
C  -5.017652 -3.303411 0.374971
C  -3.852073 -6.736476 0.12848
C  -4.543908 0.288651 0.67933
H  5.147241 1.475945 -2.104464
H  4.814538 -0.168723 -1.625398
H  2.782688 0.367405 0.571496
H  3.205053 2.010189 -3.346619
H  0.793796 2.396057 -3.461709
H  5.990638 0.406678 0.171765
H  -1.82227 -0.644325 0.717028
H  4.975315 1.701526 2.777023
H  3.499535 2.293595 1.972625
H  4.676393 3.44992 2.637082
H  -3.187936 2.788051 -2.955948
H  -2.883165 4.368458 -2.205281
H  -3.402228 3.000794 -1.200756
H  -6.091506 -3.411213 0.336166
H  -3.260122 -6.846562 1.036397
H  -3.187494 -6.70162 -0.73393
H  -4.518146 -7.589086 0.031326
H  -3.917989 0.501109 -0.186369
H  -5.358227 1.006866 0.713774
H  -3.956898 0.377677 1.593828
H  -0.503349 -3.841048 0.428305
elementType: S O N C H
totalener: -2407.87394764 hartree
nucrepener: 4074.80024129 hartree
electener: -6482.67418894 hartree
twoeener: 4931.49865470 hartree
cpcmener: -0.06997942 hartree
kineticenergy: 2399.60654778 hartree
xcener: -185.888317407311 hartree
chargesum: -0.0000000
charge: 0.887607 0.843485 -0.518782 -0.506684 -0.271715 -0.542410 -0.555305 -0.440546 -0.490257 -0.301132 -0.300929 -0.251931 -0.188881 -0.137481 -0.426874 -0.429464 -0.111441 -0.011983 0.005527 -0.064577 0.053382 -0.134036 -0.164730 0.434112 -0.226975 0.385630 0.371920 -0.123373 0.421397 0.424953 -0.325492 -0.114105 -0.119028 0.125275 0.128775 0.147404 0.146009 0.151940 0.183358 0.219296 0.138439 0.118699 0.140151 0.124210 0.136760 0.115142 0.146266 0.114062 0.113813 0.132801 0.098835 0.142837 0.114568 0.191479
qa: 0.8876 0.8435 -0.5188 -0.5067 -0.2717 -0.5424 -0.5553 -0.4405 -0.4903 -0.3011 -0.3009 -0.2519 -0.1889 -0.1375 -0.4269 -0.4295 -0.1114 -0.0120 0.0055 -0.0646 0.0534 -0.1340 -0.1647 0.4341 -0.2270 0.3856 0.3719 -0.1234 0.4214 0.4250 -0.3255 -0.1141 -0.1190 0.1253 0.1288 0.1474 0.1460 0.1519 0.1834 0.2193 0.1384 0.1187 0.1402 0.1242 0.1368 0.1151 0.1463 0.1141 0.1138 0.1328 0.0988 0.1428 0.1146 0.1915
va: 5.8040 5.7714 1.9655 1.9896 2.1381 1.9114 1.9198 2.0569 2.0238 2.1197 2.1316 2.9910 3.0970 3.1838 2.9671 2.9756 3.7937 3.6905 3.8525 3.8017 3.7399 3.9893 4.0256 4.1094 3.8770 4.3995 4.2470 3.8553 4.0143 3.9819 3.9316 3.8463 3.8403 1.0034 0.9929 1.0416 0.9996 1.0051 1.0158 1.0521 1.0088 1.0145 1.0122 0.9932 0.9945 0.9913 1.0163 0.9956 0.9954 0.9933 1.0061 0.9954 0.9954 1.0175
dispcorr: -0.032691681 hartree
energy: -2407.906639323937
dipole: -6.83912 4.96190 -1.87722 -2.40591 0.15092 -2.25499 -4.91053 2.99602 -1.91451
magnitude: 3.50347 au
magnitude: 8.90512 debye
