program: Orca
programVersion: 4.2.1
elementType: S S O O O O O O O O O N N N N N C C C C C C C C C C C C C C C C C H H H H H H H H H H H H H H H H H H H H H
charge: 0
multiplicity: 1
keywords: wb97x-d3
keywords: def2-TZVPP
keywords: def2/J RIJCOSX GRIDX6 NOFINALGRIDX
keywords: grid4 nofinalgrid
keywords: scfconv7
keywords: smallprint printgap noloewdin
keywords: NOSOSCF
formula: C17H21N5O9S2
InChI: InChI=1S/C17H21N5O9S2/c1-29-13-8-14(30-2)20-16(19-13)21-17(24)22-33(27,28)12-7-10(9-18-32(4,25)26)5-6-11(12)15(23)31-3/h5-8,18,21-22H,9H2,1-4H3
54 atoms
S  0.298311 -0.118286 -1.31642
S  5.595965 2.037797 -1.034017
O  1.394351 -0.854786 -1.910109
O  -0.6461 0.574841 -2.174333
O  -1.559168 3.378611 -0.607122
O  7.046644 2.070779 -1.168389
O  4.859185 3.293551 -0.971998
O  -2.043882 1.440014 0.399393
O  1.035525 -1.985586 0.851082
O  -4.980571 -4.652355 2.539897
O  -4.994956 -1.480338 -0.846156
N  5.192665 1.159926 0.308329
N  -0.644912 -1.15527 -0.431727
N  -1.064029 -2.726765 1.221029
N  -3.012906 -3.693061 1.879693
N  -3.028002 -2.077264 0.159271
C  0.974332 1.051641 -0.168336
C  2.928298 1.899599 0.94268
C  4.370153 1.763718 1.344682
C  2.310661 0.926018 0.166765
C  0.2176 2.143397 0.257577
C  2.184622 2.994017 1.357217
C  0.844796 3.116136 1.021147
C  -1.249481 2.260401 0.014409
C  4.956867 1.080929 -2.379965
C  -0.142518 -1.953635 0.558526
C  -2.431464 -2.82884 1.068559
C  -2.949214 3.629242 -0.847883
C  -4.328183 -3.807151 1.759664
C  -4.347084 -2.205043 0.04992
C  -5.073638 -3.075237 0.843272
C  -4.250099 -5.42868 3.486979
C  -4.261723 -0.567054 -1.660576
H  4.437395 1.087285 2.197216
H  4.753205 2.726706 1.687606
H  2.883753 0.078291 -0.180918
H  2.653114 3.772791 1.945081
H  0.288532 3.978373 1.36282
H  5.96031 0.595461 0.650402
H  -1.668596 -1.120998 -0.546984
H  5.411463 0.093248 -2.373473
H  5.205781 1.594616 -3.307486
H  3.876579 0.994249 -2.29108
H  -3.504305 3.70584 0.085982
H  -3.386586 2.849702 -1.471154
H  -2.99266 4.577316 -1.374546
H  -6.145068 -3.178218 0.755627
H  -3.527744 -6.082784 3.000014
H  -4.991061 -6.034917 4.00029
H  -3.736233 -4.800584 4.213715
H  -4.996223 -0.095516 -2.307402
H  -3.77428 0.199551 -1.059232
H  -3.525468 -1.080111 -2.279601
H  -0.667903 -3.313078 1.943849
elementType: S O N C H
totalener: -2407.87388797 hartree
nucrepener: 4078.57103628 hartree
electener: -6486.44492425 hartree
twoeener: 4935.19424135 hartree
cpcmener: -0.06939860 hartree
kineticenergy: 2399.60757500 hartree
xcener: -185.889034586112 hartree
chargesum: 0.0000000
charge: 0.888962 0.840500 -0.505632 -0.520388 -0.272426 -0.553871 -0.541070 -0.441391 -0.490373 -0.300914 -0.300790 -0.253132 -0.189810 -0.137261 -0.426728 -0.426582 -0.106308 -0.008143 0.011911 -0.079135 0.050645 -0.133070 -0.165271 0.438460 -0.228570 0.384379 0.370634 -0.124682 0.419352 0.423955 -0.324842 -0.114837 -0.113947 0.129092 0.123338 0.148651 0.146140 0.152384 0.183712 0.219787 0.139817 0.141195 0.117168 0.124957 0.115941 0.136885 0.146872 0.114309 0.132808 0.114261 0.142702 0.093291 0.115172 0.191895
qa: 0.8890 0.8405 -0.5056 -0.5204 -0.2724 -0.5539 -0.5411 -0.4414 -0.4904 -0.3009 -0.3008 -0.2531 -0.1898 -0.1373 -0.4267 -0.4266 -0.1063 -0.0081 0.0119 -0.0791 0.0506 -0.1331 -0.1653 0.4385 -0.2286 0.3844 0.3706 -0.1247 0.4194 0.4240 -0.3248 -0.1148 -0.1139 0.1291 0.1233 0.1487 0.1461 0.1524 0.1837 0.2198 0.1398 0.1412 0.1172 0.1250 0.1159 0.1369 0.1469 0.1143 0.1328 0.1143 0.1427 0.0933 0.1152 0.1919
va: 5.8058 5.7787 1.9910 1.9641 2.1395 1.9211 1.9142 2.0537 2.0242 2.1199 2.1316 2.9904 3.0984 3.1836 2.9685 2.9757 3.7872 3.6881 3.8473 3.8001 3.7413 3.9859 4.0254 4.1026 3.8751 4.4019 4.2487 3.8566 4.0177 3.9818 3.9314 3.8456 3.8408 0.9930 1.0045 1.0420 0.9996 1.0057 1.0158 1.0536 1.0089 1.0124 1.0151 0.9927 0.9904 0.9944 1.0161 0.9954 0.9934 0.9953 0.9955 1.0053 0.9955 1.0173
dispcorr: -0.032790651 hartree
energy: -2407.906678619785
dipole: -8.12679 5.68058 -2.44621 1.07875 -1.73074 -0.65199 4.19715 -1.66523 2.53192
magnitude: 3.58045 au
magnitude: 9.10079 debye
