program: Orca
programVersion: 4.2.1
elementType: S S O O O O O O O O O N N N N N C C C C C C C C C C C C C C C C C H H H H H H H H H H H H H H H H H H H H H
charge: 0
multiplicity: 1
keywords: wb97x-d3
keywords: def2-TZVPP
keywords: def2/J RIJCOSX GRIDX6 NOFINALGRIDX
keywords: grid4 nofinalgrid
keywords: scfconv7
keywords: smallprint printgap noloewdin
keywords: NOSOSCF
formula: C17H21N5O9S2
InChI: InChI=1S/C17H21N5O9S2/c1-29-13-8-14(30-2)20-16(19-13)21-17(24)22-33(27,28)12-7-10(9-18-32(4,25)26)5-6-11(12)15(23)31-3/h5-8,18,21-22H,9H2,1-4H3
54 atoms
S  -0.527857 1.923098 1.284021
S  5.189787 -0.141147 -0.403288
O  -1.707905 2.664917 0.874379
O  0.107139 2.230501 2.548212
O  -1.578501 0.897371 -1.571188
O  5.853623 -1.093371 0.475593
O  5.848984 0.287433 -1.628923
O  -1.567771 2.897045 -2.572523
O  1.027597 -0.577679 1.559318
O  -3.673323 -5.222768 -0.030603
O  -5.194494 -0.918594 0.799039
N  4.943902 1.210948 0.501172
N  -1.028666 0.342763 1.291966
N  -0.707911 -1.944547 1.087272
N  -2.180528 -3.582763 0.523468
N  -2.9602 -1.392734 0.931093
C  0.69884 2.060304 0.007086
C  3.017421 2.401973 -0.535489
C  4.457965 2.445434 -0.100233
C  2.018589 2.170929 0.404538
C  0.335885 2.202594 -1.334478
C  2.659995 2.5654 -1.864541
C  1.33226 2.478969 -2.258011
C  -1.048603 2.063526 -1.874806
C  3.618384 -0.839858 -0.842633
C  -0.157832 -0.711406 1.337002
C  -2.013321 -2.311065 0.833687
C  -2.878809 0.609462 -2.096284
C  -3.428572 -3.96477 0.290158
C  -4.207844 -1.793697 0.701815
C  -4.514598 -3.100183 0.367883
C  -2.584663 -6.138469 -0.134516
C  -4.908021 0.408565 1.233934
H  4.595981 3.22139 0.651952
H  5.101363 2.710755 -0.936583
H  2.281311 2.084159 1.449965
H  3.420039 2.759614 -2.610162
H  1.078296 2.603728 -3.301749
H  4.586858 1.008461 1.428828
H  -2.016101 0.136644 1.084978
H  3.031828 -1.024537 0.053972
H  3.812422 -1.782088 -1.35375
H  3.079788 -0.174202 -1.511746
H  -2.87734 0.642019 -3.184747
H  -3.625205 1.30531 -1.71562
H  -3.113534 -0.399939 -1.774276
H  -5.527453 -3.425801 0.182663
H  -2.059959 -6.250086 0.813391
H  -1.877625 -5.836872 -0.906298
H  -3.029768 -7.090068 -0.410643
H  -4.282003 0.945938 0.52126
H  -5.868521 0.911486 1.294924
H  -4.436314 0.41974 2.215861
H  -0.038694 -2.702893 1.075437
elementType: S O N C H
totalener: -2407.87471467 hartree
nucrepener: 4170.37794545 hartree
electener: -6578.25266012 hartree
twoeener: 5023.21535153 hartree
cpcmener: -0.07327695 hartree
kineticenergy: 2399.61656292 hartree
xcener: -185.892203783217 hartree
chargesum: 0.0000000
charge: 0.900609 0.839758 -0.520072 -0.507998 -0.259917 -0.558170 -0.546553 -0.448181 -0.477558 -0.298507 -0.292527 -0.231797 -0.184151 -0.134794 -0.424237 -0.433750 -0.157908 -0.119922 -0.001849 0.023479 0.075238 -0.089771 -0.160157 0.447726 -0.270277 0.387213 0.377903 -0.156017 0.418517 0.396000 -0.311037 -0.114863 -0.114573 0.136323 0.122750 0.122338 0.147699 0.153077 0.179201 0.197266 0.134260 0.154503 0.133876 0.143808 0.128290 0.129800 0.147629 0.114532 0.114839 0.133405 0.090291 0.142726 0.127597 0.193933
qa: 0.9006 0.8398 -0.5201 -0.5080 -0.2599 -0.5582 -0.5466 -0.4482 -0.4776 -0.2985 -0.2925 -0.2318 -0.1842 -0.1348 -0.4242 -0.4338 -0.1579 -0.1199 -0.0018 0.0235 0.0752 -0.0898 -0.1602 0.4477 -0.2703 0.3872 0.3779 -0.1560 0.4185 0.3960 -0.3110 -0.1149 -0.1146 0.1363 0.1228 0.1223 0.1477 0.1531 0.1792 0.1973 0.1343 0.1545 0.1339 0.1438 0.1283 0.1298 0.1476 0.1145 0.1148 0.1334 0.0903 0.1427 0.1276 0.1939
va: 5.7912 5.7990 1.9662 1.9894 2.1178 1.9144 1.9102 2.0522 2.0366 2.1248 2.1271 3.0177 3.0899 3.1902 2.9713 2.9302 3.8517 3.6874 3.8622 3.7707 3.7033 3.8894 4.0267 4.1055 3.8555 4.3775 4.2313 3.8446 4.0251 3.9857 3.9421 3.8448 3.8505 0.9949 1.0094 1.0456 1.0021 1.0054 1.0210 1.0764 1.0297 1.0128 1.0049 0.9998 0.9836 0.9933 1.0155 0.9954 0.9953 0.9933 0.9812 0.9958 0.9907 1.0154
dispcorr: -0.036003222 hartree
energy: -2407.910717896325
dipole: -7.80048 4.71696 -3.08352 -9.27514 7.04098 -2.23416 -7.23727 6.16769 -1.06958
magnitude: 3.95520 au
magnitude: 10.05331 debye
