program: Orca
programVersion: 4.2.1
elementType: S S O O O O O O O O O N N N N N C C C C C C C C C C C C C C C C C H H H H H H H H H H H H H H H H H H H H H
charge: 0
multiplicity: 1
keywords: wb97x-d3
keywords: def2-TZVPP
keywords: def2/J RIJCOSX GRIDX6 NOFINALGRIDX
keywords: grid4 nofinalgrid
keywords: scfconv7
keywords: smallprint printgap noloewdin
keywords: NOSOSCF
formula: C17H21N5O9S2
InChI: InChI=1S/C17H21N5O9S2/c1-29-13-8-14(30-2)20-16(19-13)21-17(24)22-33(27,28)12-7-10(9-18-32(4,25)26)5-6-11(12)15(23)31-3/h5-8,18,21-22H,9H2,1-4H3
54 atoms
S  -0.228578 0.984607 -1.625922
S  5.745329 0.32245 -0.545952
O  0.714525 0.653144 -2.672322
O  -1.392515 1.793471 -1.939957
O  -1.978163 3.765273 0.648625
O  6.11634 -0.130678 0.788954
O  6.786053 0.546585 -1.539684
O  -2.196708 1.563211 0.983803
O  1.133433 -1.390316 -0.527125
O  -4.047032 -5.061296 1.874993
O  -5.15384 -1.181718 -0.414918
N  4.91011 1.721895 -0.411892
N  -0.863607 -0.412502 -0.991347
N  -0.750141 -2.445791 0.124296
N  -2.389651 -3.754743 0.994846
N  -2.958027 -1.774634 -0.158816
C  0.652029 1.75112 -0.292316
C  2.76879 2.296412 0.70238
C  4.268687 2.180538 0.796141
C  2.035204 1.666087 -0.291524
C  -0.031919 2.489801 0.670166
C  2.091984 3.042661 1.65956
C  0.711801 3.148299 1.639914
C  -1.521054 2.536647 0.766018
C  4.60688 -0.863362 -1.206545
C  -0.07923 -1.408839 -0.475215
C  -2.098912 -2.655903 0.322935
C  -3.39249 3.953627 0.781682
C  -3.678684 -3.984066 1.202174
C  -4.247313 -2.022729 0.052563
C  -4.682619 -3.139396 0.744521
C  -3.044747 -5.944368 2.374262
C  -4.725945 -0.025696 -1.132702
H  4.513931 1.502671 1.614627
H  4.689077 3.146568 1.079099
H  2.543024 1.11953 -1.072153
H  2.647452 3.555727 2.434628
H  0.21295 3.737898 2.397142
H  5.088531 2.398671 -1.141895
H  -1.879005 -0.467899 -0.828731
H  4.232169 -0.515464 -2.16631
H  3.786179 -1.012984 -0.5090
H  5.13855 -1.804438 -1.343206
H  -3.744528 3.631981 1.760735
H  -3.933246 3.417852 0.002201
H  -3.561067 5.019834 0.667898
H  -5.729853 -3.338531 0.917797
H  -3.583052 -6.735347 2.88876
H  -2.382998 -5.444416 3.080602
H  -2.452781 -6.379313 1.569843
H  -4.147016 0.645322 -0.498399
H  -4.149199 -0.289952 -2.019082
H  -5.636004 0.479811 -1.44333
H  -0.145001 -3.161335 0.504806
elementType: S O N C H
totalener: -2407.87518499 hartree
nucrepener: 4079.69559918 hartree
electener: -6487.57078417 hartree
twoeener: 4935.31719881 hartree
cpcmener: -0.06730848 hartree
kineticenergy: 2399.58938616 hartree
xcener: -185.892489415989 hartree
chargesum: 0.0000000
charge: 0.893325 0.844961 -0.505145 -0.518213 -0.271672 -0.548445 -0.558078 -0.440168 -0.487869 -0.301076 -0.300218 -0.250402 -0.201317 -0.133219 -0.427729 -0.427569 -0.189840 0.035282 -0.024171 -0.011497 0.072198 -0.148778 -0.168789 0.436436 -0.267908 0.385897 0.372446 -0.125218 0.420200 0.425143 -0.328536 -0.114670 -0.112803 0.128543 0.124573 0.160385 0.146926 0.151533 0.196200 0.221615 0.138285 0.129141 0.152802 0.122873 0.118090 0.137022 0.146879 0.132593 0.114567 0.114012 0.092210 0.116249 0.141896 0.191048
qa: 0.8933 0.8450 -0.5051 -0.5182 -0.2717 -0.5484 -0.5581 -0.4402 -0.4879 -0.3011 -0.3002 -0.2504 -0.2013 -0.1332 -0.4277 -0.4276 -0.1898 0.0353 -0.0242 -0.0115 0.0722 -0.1488 -0.1688 0.4364 -0.2679 0.3859 0.3724 -0.1252 0.4202 0.4251 -0.3285 -0.1147 -0.1128 0.1285 0.1246 0.1604 0.1469 0.1515 0.1962 0.2216 0.1383 0.1291 0.1528 0.1229 0.1181 0.1370 0.1469 0.1326 0.1146 0.1140 0.0922 0.1162 0.1419 0.1910
va: 5.8067 5.8080 1.9925 1.9702 2.1386 1.9071 1.9117 2.0540 2.0254 2.1200 2.1307 3.0329 3.0917 3.1782 2.9677 2.9684 3.8938 3.7026 3.8953 3.8049 3.7232 3.9966 4.0174 4.1046 3.8614 4.3829 4.2449 3.8567 4.0149 3.9798 3.9337 3.8459 3.8436 1.0097 0.9949 1.0096 0.9979 1.0054 1.0092 1.0499 1.0098 1.0196 1.0096 0.9935 0.9898 0.9942 1.0160 0.9934 0.9955 0.9955 1.0028 0.9945 0.9958 1.0182
dispcorr: -0.032550597 hartree
energy: -2407.907735587580
dipole: -8.71885 5.52983 -3.18902 -0.26386 1.14861 0.88475 7.92940 -5.50622 2.42318
magnitude: 4.10176 au
magnitude: 10.42585 debye
