program: Orca
programVersion: 4.2.1
elementType: S S O O O O O O O O O N N N N N C C C C C C C C C C C C C C C C C H H H H H H H H H H H H H H H H H H H H H
charge: 0
multiplicity: 1
keywords: wb97x-d3
keywords: def2-TZVPP
keywords: def2/J RIJCOSX GRIDX6 NOFINALGRIDX
keywords: grid4 nofinalgrid
keywords: scfconv7
keywords: smallprint printgap noloewdin
keywords: NOSOSCF
formula: C17H21N5O9S2
InChI: InChI=1S/C17H21N5O9S2/c1-29-13-8-14(30-2)20-16(19-13)21-17(24)22-33(27,28)12-7-10(9-18-32(4,25)26)5-6-11(12)15(23)31-3/h5-8,18,21-22H,9H2,1-4H3
54 atoms
S  -0.273029 1.501076 1.146557
S  5.703807 0.534894 0.561764
O  -1.446048 2.355984 1.121469
O  0.628468 1.558232 2.277208
O  -1.925632 3.297205 -2.036592
O  6.528644 1.021094 1.658415
O  6.333091 -0.169047 -0.54878
O  -2.126408 1.11771 -1.570538
O  1.123689 -1.093963 0.978355
O  -4.008126 -5.465205 0.165303
O  -5.156678 -0.998988 0.676008
N  4.910244 1.832726 -0.027962
N  -0.885761 -0.035366 1.008609
N  -0.742958 -2.336072 0.733087
N  -2.366382 -3.899655 0.450639
N  -2.95666 -1.62722 0.699238
C  0.662417 1.778097 -0.334214
C  2.822104 2.001232 -1.362352
C  4.327349 1.911075 -1.343566
C  2.044771 1.72755 -0.246912
C  0.021069 2.13313 -1.518157
C  2.187176 2.364431 -2.544208
C  0.807225 2.440227 -2.620878
C  -1.461988 2.116062 -1.686629
C  4.468026 -0.547474 1.229334
C  -0.087282 -1.143014 0.913887
C  -2.087891 -2.620604 0.623881
C  -3.331489 3.400558 -2.292329
C  -3.652039 -4.204201 0.344607
C  -4.242371 -1.950571 0.597394
C  -4.664936 -3.255368 0.412808
C  -2.997107 -6.46728 0.083317
C  -4.738508 0.351375 0.866028
H  4.744608 2.771912 -1.868729
H  4.633541 1.039122 -1.923132
H  2.516034 1.489428 0.695042
H  2.775957 2.599423 -3.422028
H  0.34198 2.727292 -3.55413
H  4.911123 2.659011 0.556721
H  -1.896617 -0.157536 0.85365
H  4.967857 -1.430788 1.62506
H  3.781303 -0.844137 0.440552
H  3.933045 -0.042577 2.029723
H  -3.505916 4.43395 -2.572718
H  -3.910138 3.166584 -1.399957
H  -3.634794 2.746849 -3.108147
H  -5.709176 -3.517126 0.328029
H  -3.526457 -7.404746 -0.061554
H  -2.411298 -6.525567 0.999807
H  -2.330368 -6.299526 -0.761679
H  -4.186968 0.475707 1.798047
H  -4.138934 0.705153 0.027744
H  -5.652255 0.93662 0.918166
H  -0.129383 -3.137081 0.664677
elementType: S O N C H
totalener: -2407.87586946 hartree
nucrepener: 4079.64966635 hartree
electener: -6487.52553581 hartree
twoeener: 4935.00807048 hartree
cpcmener: -0.06792344 hartree
kineticenergy: 2399.59023145 hartree
xcener: -185.893926646493 hartree
chargesum: 0.0000000
charge: 0.893928 0.841870 -0.519154 -0.506062 -0.271848 -0.557925 -0.548979 -0.442166 -0.485693 -0.301573 -0.300653 -0.243885 -0.200051 -0.132588 -0.428485 -0.427829 -0.177914 0.040471 -0.023978 -0.019385 0.063822 -0.149506 -0.168285 0.440769 -0.263558 0.385316 0.373073 -0.124014 0.419958 0.424491 -0.327381 -0.114089 -0.115285 0.125017 0.129570 0.153227 0.146777 0.152084 0.195084 0.221371 0.153126 0.133319 0.129002 0.136437 0.117544 0.122978 0.147026 0.132480 0.113684 0.114426 0.115328 0.095819 0.141581 0.190706
qa: 0.8939 0.8419 -0.5192 -0.5061 -0.2718 -0.5579 -0.5490 -0.4422 -0.4857 -0.3016 -0.3007 -0.2439 -0.2001 -0.1326 -0.4285 -0.4278 -0.1779 0.0405 -0.0240 -0.0194 0.0638 -0.1495 -0.1683 0.4408 -0.2636 0.3853 0.3731 -0.1240 0.4200 0.4245 -0.3274 -0.1141 -0.1153 0.1250 0.1296 0.1532 0.1468 0.1521 0.1951 0.2214 0.1531 0.1333 0.1290 0.1364 0.1175 0.1230 0.1470 0.1325 0.1137 0.1144 0.1153 0.0958 0.1416 0.1907
va: 5.8065 5.8181 1.9685 1.9916 2.1390 1.9118 1.9050 2.0525 2.0313 2.1194 2.1307 3.0312 3.0927 3.1767 2.9672 2.9704 3.8860 3.7069 3.8941 3.7937 3.7301 4.0036 4.0183 4.0987 3.8692 4.3855 4.2440 3.8565 4.0158 3.9812 3.9311 3.8461 3.8434 0.9947 1.0082 1.0202 0.9981 1.0054 1.0094 1.0496 1.0091 1.0120 1.0146 0.9944 0.9905 0.9935 1.0160 0.9934 0.9955 0.9955 0.9950 1.0031 0.9958 1.0183
dispcorr: -0.032736520 hartree
energy: -2407.908605983032
dipole: -8.74554 5.46752 -3.27802 -3.57388 3.37133 -0.20255 -8.19332 5.32420 -2.86912
magnitude: 4.36100 au
magnitude: 11.08478 debye
