program: Orca
programVersion: 4.2.1
elementType: S S O O O O O O O O O N N N N N C C C C C C C C C C C C C C C C C H H H H H H H H H H H H H H H H H H H H H
charge: 0
multiplicity: 1
keywords: wb97x-d3
keywords: def2-TZVPP
keywords: def2/J RIJCOSX GRIDX6 NOFINALGRIDX
keywords: grid4 nofinalgrid
keywords: scfconv7
keywords: smallprint printgap noloewdin
keywords: NOSOSCF
formula: C17H21N5O9S2
InChI: InChI=1S/C17H21N5O9S2/c1-29-13-8-14(30-2)20-16(19-13)21-17(24)22-33(27,28)12-7-10(9-18-32(4,25)26)5-6-11(12)15(23)31-3/h5-8,18,21-22H,9H2,1-4H3
54 atoms
S  -0.243762 0.988169 -1.638494
S  5.733404 0.286614 -0.52132
O  0.684103 0.646129 -2.694524
O  -1.413547 1.793099 -1.942483
O  -1.96824 3.795626 0.540568
O  6.158332 -0.07996 0.824803
O  6.732777 0.437579 -1.570256
O  -2.185457 1.621182 1.024902
O  1.128579 -1.382654 -0.548287
O  -4.01789 -5.085628 1.873403
O  -5.159385 -1.178503 -0.351646
N  4.911747 1.699015 -0.452506
N  -0.872644 -0.399548 -0.978155
N  -0.746823 -2.441063 0.121068
N  -2.374171 -3.764327 0.990656
N  -2.959113 -1.770429 -0.130975
C  0.653932 1.769672 -0.325593
C  2.777049 2.323876 0.649321
C  4.278521 2.216511 0.735418
C  2.037446 1.681153 -0.332052
C  -0.022914 2.521874 0.63024
C  2.106302 3.083042 1.601128
C  0.726506 3.191245 1.588148
C  -1.511811 2.576695 0.732857
C  4.559512 -0.931038 -1.049961
C  -0.083214 -1.400286 -0.479159
C  -2.093128 -2.656583 0.329373
C  -3.381234 3.994984 0.6713
C  -3.659953 -3.997745 1.212231
C  -4.245343 -2.023449 0.09372
C  -4.670531 -3.148901 0.777756
C  -3.007302 -5.974548 2.344778
C  -4.743441 -0.014722 -1.06323
H  4.533463 1.584033 1.586733
H  4.697557 3.197424 0.964079
H  2.540128 1.122406 -1.107607
H  2.667353 3.603992 2.367022
H  0.232452 3.790726 2.340881
H  5.097953 2.340362 -1.212162
H  -1.887167 -0.456637 -0.813383
H  4.149547 -0.647668 -2.016543
H  3.766575 -1.020027 -0.311514
H  5.077259 -1.885329 -1.139345
H  -3.550397 5.048999 0.475921
H  -3.724092 3.751608 1.676006
H  -3.930159 3.400163 -0.058205
H  -5.715272 -3.351336 0.961919
H  -2.423306 -6.392681 1.525758
H  -3.537079 -6.776471 2.851097
H  -2.338752 -5.485394 3.052325
H  -5.658268 0.495117 -1.351645
H  -4.153123 0.648886 -0.43168
H  -4.182928 -0.269038 -1.962756
H  -0.137419 -3.161891 0.484349
elementType: S O N C H
totalener: -2407.87528754 hartree
nucrepener: 4078.79499198 hartree
electener: -6486.67027952 hartree
twoeener: 4934.32788449 hartree
cpcmener: -0.06757023 hartree
kineticenergy: 2399.58497321 hartree
xcener: -185.891261143478 hartree
chargesum: 0.0000000
charge: 0.891769 0.843992 -0.503581 -0.518451 -0.270656 -0.548209 -0.558498 -0.439657 -0.486962 -0.301110 -0.300193 -0.250729 -0.200875 -0.133377 -0.427930 -0.429059 -0.177878 0.037702 -0.025804 -0.018443 0.068767 -0.152044 -0.165876 0.431619 -0.265640 0.386840 0.373261 -0.126850 0.420126 0.425505 -0.328429 -0.114574 -0.112637 0.129432 0.125853 0.158435 0.147069 0.151838 0.196217 0.221556 0.135720 0.130876 0.153053 0.136951 0.124015 0.118048 0.146930 0.113873 0.132541 0.114747 0.141776 0.091341 0.116589 0.191023
qa: 0.8918 0.8440 -0.5036 -0.5185 -0.2707 -0.5482 -0.5585 -0.4397 -0.4870 -0.3011 -0.3002 -0.2507 -0.2009 -0.1334 -0.4279 -0.4291 -0.1779 0.0377 -0.0258 -0.0184 0.0688 -0.1520 -0.1659 0.4316 -0.2656 0.3868 0.3733 -0.1269 0.4201 0.4255 -0.3284 -0.1146 -0.1126 0.1294 0.1259 0.1584 0.1471 0.1518 0.1962 0.2216 0.1357 0.1309 0.1531 0.1370 0.1240 0.1180 0.1469 0.1139 0.1325 0.1147 0.1418 0.0913 0.1166 0.1910
va: 5.8068 5.8079 1.9947 1.9693 2.1371 1.9060 1.9111 2.0537 2.0278 2.1201 2.1309 3.0301 3.0927 3.1785 2.9671 2.9688 3.8832 3.7015 3.8954 3.8047 3.7327 3.9997 4.0147 4.1082 3.8628 4.3833 4.2441 3.8576 4.0148 3.9796 3.9336 3.8458 3.8441 1.0094 0.9947 1.0140 0.9977 1.0042 1.0094 1.0488 1.0118 1.0172 1.0094 0.9941 0.9930 0.9896 1.0160 0.9956 0.9934 0.9954 0.9961 1.0032 0.9943 1.0182
dispcorr: -0.032603901 hartree
energy: -2407.907891441452
dipole: -8.70246 5.53119 -3.17126 -0.28441 1.15598 0.87157 8.02600 -5.63023 2.39577
magnitude: 4.06894 au
magnitude: 10.34241 debye
