program: Orca
programVersion: 4.2.1
elementType: S S O O O O O O O O O N N N N N C C C C C C C C C C C C C C C C C H H H H H H H H H H H H H H H H H H H H H
charge: 0
multiplicity: 1
keywords: wb97x-d3
keywords: def2-TZVPP
keywords: def2/J RIJCOSX GRIDX6 NOFINALGRIDX
keywords: grid4 nofinalgrid
keywords: scfconv7
keywords: smallprint printgap noloewdin
keywords: NOSOSCF
formula: C17H21N5O9S2
InChI: InChI=1S/C17H21N5O9S2/c1-29-13-8-14(30-2)20-16(19-13)21-17(24)22-33(27,28)12-7-10(9-18-32(4,25)26)5-6-11(12)15(23)31-3/h5-8,18,21-22H,9H2,1-4H3
54 atoms
S  -0.541547 1.895547 1.323498
S  4.974744 -0.215276 -0.650264
O  -1.745289 2.605986 0.931265
O  0.092745 2.20644 2.585878
O  -1.682061 3.114852 -2.250408
O  5.952842 -1.090069 -0.014508
O  5.192397 0.191793 -2.034639
O  -1.739852 0.960246 -1.646482
O  1.04365 -0.523626 1.89448
O  -3.364765 -5.513426 0.570039
O  -4.972334 -1.178694 0.182407
N  4.836226 1.109041 0.339752
N  -0.989692 0.297534 1.305217
N  -0.604129 -1.989402 1.424086
N  -1.97675 -3.748845 1.001619
N  -2.797319 -1.544864 0.793492
C  0.658292 2.067478 0.029436
C  2.955054 2.353762 -0.608429
C  4.409847 2.38025 -0.236218
C  1.993259 2.148161 0.376778
C  0.243273 2.212097 -1.296211
C  2.548256 2.504393 -1.924264
C  1.20301 2.4490 -2.265516
C  -1.17369 2.020599 -1.727236
C  3.3885 -0.997311 -0.561783
C  -0.108167 -0.717033 1.56572
C  -1.855737 -2.4352 1.053934
C  -3.030038 3.043261 -2.730285
C  -3.169424 -4.208052 0.650054
C  -3.989359 -2.022103 0.446727
C  -4.244757 -3.379074 0.354653
C  -2.283716 -6.396062 0.861838
C  -4.71999 0.223675 0.247904
H  4.57733 3.125955 0.53993
H  5.014901 2.677132 -1.095065
H  2.298784 2.051396 1.409123
H  3.283314 2.66784 -2.701286
H  0.911022 2.565679 -3.300415
H  5.656239 1.190293 0.931378
H  -1.92567 0.044165 0.957328
H  3.152349 -1.225851 0.472851
H  3.450619 -1.916448 -1.143061
H  2.624634 -0.354907 -0.991575
H  -3.257354 4.028821 -3.123357
H  -3.720696 2.809746 -1.920287
H  -3.130516 2.302874 -3.522303
H  -5.212018 -3.766215 0.070366
H  -2.678775 -7.39808 0.72059
H  -1.941664 -6.288298 1.890535
H  -1.444222 -6.244056 0.184391
H  -4.416028 0.53396 1.247801
H  -3.968583 0.525348 -0.480681
H  -5.663284 0.703593 0.002914
H  0.068328 -2.719248 1.618995
elementType: S O N C H
totalener: -2407.87519375 hartree
nucrepener: 4150.37542332 hartree
electener: -6558.25061708 hartree
twoeener: 5005.70476161 hartree
cpcmener: -0.06711096 hartree
kineticenergy: 2399.61518859 hartree
xcener: -185.886931526712 hartree
chargesum: -0.0000000
charge: 0.894695 0.837268 -0.517967 -0.503474 -0.269336 -0.563277 -0.539428 -0.438120 -0.478435 -0.301146 -0.300841 -0.228975 -0.195774 -0.135854 -0.429068 -0.429120 -0.125121 -0.142999 -0.014868 0.019301 0.067499 -0.057833 -0.163117 0.427686 -0.242437 0.380556 0.372729 -0.123980 0.420677 0.425902 -0.328839 -0.114680 -0.115245 0.136528 0.124173 0.117189 0.145029 0.153298 0.173499 0.220260 0.132582 0.156013 0.124338 0.137383 0.116158 0.124066 0.147559 0.132611 0.114474 0.114264 0.116498 0.093402 0.142495 0.191799
qa: 0.8947 0.8373 -0.5180 -0.5035 -0.2693 -0.5633 -0.5394 -0.4381 -0.4784 -0.3011 -0.3008 -0.2290 -0.1958 -0.1359 -0.4291 -0.4291 -0.1251 -0.1430 -0.0149 0.0193 0.0675 -0.0578 -0.1631 0.4277 -0.2424 0.3806 0.3727 -0.1240 0.4207 0.4259 -0.3288 -0.1147 -0.1152 0.1365 0.1242 0.1172 0.1450 0.1533 0.1735 0.2203 0.1326 0.1560 0.1243 0.1374 0.1162 0.1241 0.1476 0.1326 0.1145 0.1143 0.1165 0.0934 0.1425 0.1918
va: 5.8033 5.7653 1.9695 1.9946 2.1409 1.9115 1.9083 2.0582 2.0327 2.1200 2.1313 2.9669 3.0976 3.1835 2.9668 2.9713 3.7678 3.6934 3.8633 3.7703 3.7082 3.8792 4.0508 4.1218 3.8563 4.3926 4.2446 3.8537 4.0157 3.9809 3.9331 3.8458 3.8404 0.9948 1.0078 1.0572 1.0067 1.0035 1.0214 1.0515 1.0296 1.0087 1.0082 0.9944 0.9910 0.9934 1.0160 0.9934 0.9954 0.9955 0.9947 1.0057 0.9959 1.0170
dispcorr: -0.034548177 hartree
energy: -2407.909741931476
dipole: -6.42193 4.45639 -1.96554 -4.23785 4.13069 -0.10716 -8.32948 6.69833 -1.63114
magnitude: 2.55646 au
magnitude: 6.49799 debye
