program: Orca
programVersion: 4.2.1
elementType: S S O O O O O O O O O N N N N N C C C C C C C C C C C C C C C C C H H H H H H H H H H H H H H H H H H H H H
charge: 0
multiplicity: 1
keywords: wb97x-d3
keywords: def2-TZVPP
keywords: def2/J RIJCOSX GRIDX6 NOFINALGRIDX
keywords: grid4 nofinalgrid
keywords: scfconv7
keywords: smallprint printgap noloewdin
keywords: NOSOSCF
formula: C17H21N5O9S2
InChI: InChI=1S/C17H21N5O9S2/c1-29-13-8-14(30-2)20-16(19-13)21-17(24)22-33(27,28)12-7-10(9-18-32(4,25)26)5-6-11(12)15(23)31-3/h5-8,18,21-22H,9H2,1-4H3
54 atoms
S  -1.386026 2.25414 0.476434
S  2.301803 -1.557376 0.52425
O  -2.290582 3.066177 -0.30713
O  -1.332952 2.416885 1.916952
O  -0.970574 3.522695 -3.047254
O  1.272403 -1.437587 -0.503613
O  1.92436 -1.281752 1.907043
O  -0.626877 5.197518 -1.603243
O  -1.699942 0.668011 -1.995122
O  -0.659971 -5.565166 0.318254
O  -0.886541 -2.186745 3.491815
N  3.620862 -0.601438 0.19166
N  -1.743434 0.643025 0.276815
N  -1.791711 -1.331482 -0.944653
N  -1.265516 -3.453766 -0.31593
N  -1.393506 -1.745184 1.306265
C  0.251086 2.39359 -0.183207
C  2.528636 1.637979 -0.023377
C  3.58135 0.790935 0.643752
C  1.230987 1.657644 0.464242
C  0.538753 3.152127 -1.310405
C  2.820137 2.386515 -1.158343
C  1.844103 3.142974 -1.786751
C  -0.439163 4.068046 -1.978883
C  2.996363 -3.180946 0.417004
C  -1.731276 0.041513 -0.958225
C  -1.46166 -2.206995 0.069726
C  -1.9190 4.305423 -3.780342
C  -0.896265 -4.301007 0.632859
C  -1.002402 -2.601774 2.242579
C  -0.726156 -3.929038 1.960819
C  -0.784728 -5.974701 -1.041112
C  -1.105123 -0.809519 3.785495
H  3.459982 0.805529 1.724912
H  4.570215 1.196075 0.438138
H  0.98854 1.093082 1.355614
H  3.827101 2.391156 -1.555881
H  2.103811 3.732027 -2.656109
H  3.876474 -0.680107 -0.789109
H  -1.646185 0.017922 1.092924
H  3.784523 -3.292909 1.156411
H  3.389002 -3.348202 -0.58375
H  2.196586 -3.892972 0.618096
H  -2.25517 3.674542 -4.596991
H  -1.461587 5.207628 -4.183967
H  -2.770914 4.574285 -3.157127
H  -0.408139 -4.627212 2.720981
H  -0.535336 -7.031994 -1.052292
H  -0.092587 -5.438051 -1.689317
H  -1.800441 -5.843501 -1.412072
H  -0.956404 -0.709975 4.856933
H  -0.385839 -0.171742 3.271878
H  -2.120799 -0.498318 3.541405
H  -1.794932 -1.744322 -1.867987
elementType: S O N C H
totalener: -2407.86802509 hartree
nucrepener: 4379.63079046 hartree
electener: -6787.49881556 hartree
twoeener: 5237.61211084 hartree
cpcmener: -0.07721527 hartree
kineticenergy: 2399.63463392 hartree
xcener: -185.886780946841 hartree
chargesum: -0.0000000
charge: 0.891431 0.830558 -0.496638 -0.519979 -0.244790 -0.523533 -0.545196 -0.452206 -0.462791 -0.304164 -0.296641 -0.197553 -0.209272 -0.138479 -0.392629 -0.395351 -0.111357 -0.088844 -0.060159 -0.092101 0.078467 -0.093703 -0.149013 0.467411 -0.233970 0.358651 0.329071 -0.129564 0.397950 0.431253 -0.344122 -0.115975 -0.116250 0.137845 0.124764 0.137066 0.151987 0.149507 0.164651 0.209645 0.142770 0.147625 0.138202 0.132068 0.122911 0.119391 0.143216 0.133338 0.111672 0.115970 0.140432 0.096602 0.119898 0.189930
qa: 0.8914 0.8306 -0.4966 -0.5200 -0.2448 -0.5235 -0.5452 -0.4522 -0.4628 -0.3042 -0.2966 -0.1976 -0.2093 -0.1385 -0.3926 -0.3954 -0.1114 -0.0888 -0.0602 -0.0921 0.0785 -0.0937 -0.1490 0.4674 -0.2340 0.3587 0.3291 -0.1296 0.3980 0.4313 -0.3441 -0.1160 -0.1163 0.1378 0.1248 0.1371 0.1520 0.1495 0.1647 0.2096 0.1428 0.1476 0.1382 0.1321 0.1229 0.1194 0.1432 0.1333 0.1117 0.1160 0.1404 0.0966 0.1199 0.1899
va: 5.8182 5.6800 1.9949 1.9730 2.1436 1.9139 1.9027 2.0417 2.0457 2.1001 2.1208 3.0385 3.0638 3.1671 2.9281 2.9465 3.7102 3.7529 3.9106 3.9324 3.7219 3.8973 4.0140 4.1422 3.9082 4.4144 4.2923 3.8550 3.9950 3.9229 3.9188 3.8485 3.8487 1.0067 0.9972 0.9900 0.9950 1.0002 1.0242 1.0799 1.0124 1.0042 0.9997 0.9943 0.9935 0.9945 1.0190 0.9935 0.9959 0.9953 0.9962 0.9866 0.9894 1.0186
dispcorr: -0.039500018 hartree
energy: -2407.907525111504
dipole: 11.50962 -7.13834 4.37127 -13.44089 9.17897 -4.26191 -3.22017 1.85092 -1.36925
magnitude: 6.25674 au
magnitude: 15.90336 debye
