program: Orca
programVersion: 4.2.1
elementType: S S O O O O O O O O O N N N N N C C C C C C C C C C C C C C C C C H H H H H H H H H H H H H H H H H H H H H
charge: 0
multiplicity: 1
keywords: wb97x-d3
keywords: def2-TZVPP
keywords: def2/J RIJCOSX GRIDX6 NOFINALGRIDX
keywords: grid4 nofinalgrid
keywords: scfconv7
keywords: smallprint printgap noloewdin
keywords: NOSOSCF
formula: C17H21N5O9S2
InChI: InChI=1S/C17H21N5O9S2/c1-29-13-8-14(30-2)20-16(19-13)21-17(24)22-33(27,28)12-7-10(9-18-32(4,25)26)5-6-11(12)15(23)31-3/h5-8,18,21-22H,9H2,1-4H3
54 atoms
S  -0.535475 1.948542 1.355957
S  4.983354 -0.2880 -0.597846
O  -1.738435 2.669377 0.982647
O  0.152198 2.292736 2.581794
O  -1.705299 2.934091 -2.390508
O  5.831161 -1.181304 0.178754
O  5.363598 0.062599 -1.959741
O  -1.857671 0.901224 -1.467322
O  1.046725 -0.473782 1.906964
O  -3.283878 -5.402366 0.180772
O  -5.017894 -1.102199 0.360687
N  4.904632 1.119266 0.246433
N  -1.009504 0.358394 1.418427
N  -0.606375 -1.929362 1.423274
N  -1.939014 -3.664933 0.812342
N  -2.822586 -1.477008 0.88798
C  0.625026 2.043002 0.016489
C  2.909633 2.288951 -0.687515
C  4.376168 2.337097 -0.352264
C  1.968204 2.14564 0.327477
C  0.181108 2.111165 -1.306244
C  2.474062 2.36021 -2.001279
C  1.122215 2.287152 -2.30806
C  -1.244049 1.910547 -1.703794
C  3.36694 -1.021718 -0.646426
C  -0.114499 -0.661679 1.607415
C  -1.852705 -2.364466 1.02142
C  -3.045694 2.838113 -2.88968
C  -3.124566 -4.112204 0.422891
C  -4.007338 -1.942567 0.502987
C  -4.227517 -3.285142 0.248779
C  -2.167257 -6.277905 0.324526
C  -4.805316 0.288526 0.597651
H  4.568028 3.130511 0.369148
H  4.958293 2.580695 -1.2388
H  2.293286 2.118062 1.358676
H  3.191232 2.477206 -2.803248
H  0.809258 2.343511 -3.341751
H  4.708706 0.990882 1.233295
H  -1.952047 0.11028 1.085178
H  3.461363 -1.988801 -1.139246
H  2.680484 -0.396088 -1.211021
H  3.000281 -1.163379 0.367308
H  -3.220579 3.75485 -3.444311
H  -3.762515 2.767641 -2.071616
H  -3.160928 1.982421 -3.55354
H  -5.189115 -3.662664 -0.066122
H  -2.533773 -7.264608 0.055749
H  -1.80051 -6.299359 1.350102
H  -1.352634 -6.004638 -0.345189
H  -4.109204 0.713035 -0.126233
H  -5.77616 0.759229 0.470052
H  -4.450657 0.478642 1.610892
H  0.082128 -2.659869 1.546724
elementType: S O N C H
totalener: -2407.87636260 hartree
nucrepener: 4158.11153853 hartree
electener: -6565.98790114 hartree
twoeener: 5012.64452920 hartree
cpcmener: -0.06891112 hartree
kineticenergy: 2399.59635429 hartree
xcener: -185.887835359365 hartree
chargesum: 0.0000000
charge: 0.898180 0.843856 -0.517059 -0.505541 -0.271755 -0.558726 -0.546595 -0.437389 -0.479047 -0.301124 -0.299788 -0.236358 -0.197540 -0.136524 -0.427371 -0.424831 -0.141001 -0.132180 0.000104 0.016480 0.075794 -0.075451 -0.160834 0.435099 -0.268042 0.379293 0.369127 -0.123861 0.419418 0.425713 -0.327792 -0.114201 -0.112366 0.137152 0.122353 0.124299 0.146072 0.152452 0.182049 0.220646 0.153944 0.128664 0.135833 0.136342 0.118892 0.123092 0.147132 0.132523 0.114368 0.114159 0.091960 0.141214 0.117422 0.191744
qa: 0.8982 0.8439 -0.5171 -0.5055 -0.2718 -0.5587 -0.5466 -0.4374 -0.4790 -0.3011 -0.2998 -0.2364 -0.1975 -0.1365 -0.4274 -0.4248 -0.1410 -0.1322 0.0001 0.0165 0.0758 -0.0755 -0.1608 0.4351 -0.2680 0.3793 0.3691 -0.1239 0.4194 0.4257 -0.3278 -0.1142 -0.1124 0.1372 0.1224 0.1243 0.1461 0.1525 0.1820 0.2206 0.1539 0.1287 0.1358 0.1363 0.1189 0.1231 0.1471 0.1325 0.1144 0.1142 0.0920 0.1412 0.1174 0.1917
va: 5.8028 5.7975 1.9720 1.9912 2.1434 1.9155 1.9089 2.0578 2.0312 2.1197 2.1297 3.0175 3.0978 3.1860 2.9689 2.9659 3.7907 3.6711 3.8575 3.7686 3.6940 3.8880 4.0453 4.1106 3.8604 4.3923 4.2472 3.8552 4.0173 3.9802 3.9360 3.8452 3.8435 0.9952 1.0083 1.0449 1.0049 1.0058 1.0178 1.0521 1.0121 1.0057 1.0268 0.9944 0.9894 0.9936 1.0160 0.9935 0.9952 0.9957 1.0007 0.9960 0.9938 1.0169
dispcorr: -0.034682478 hartree
energy: -2407.911045081792
dipole: -7.40529 4.56462 -2.84067 -4.66929 4.39500 -0.27429 -9.48494 7.62823 -1.85671
magnitude: 3.40470 au
magnitude: 8.65406 debye
