program: Orca
programVersion: 4.2.1
elementType: S S O O O O O O O O O N N N N N C C C C C C C C C C C C C C C C C H H H H H H H H H H H H H H H H H H H H H
charge: 0
multiplicity: 1
keywords: wb97x-d3
keywords: def2-TZVPP
keywords: def2/J RIJCOSX GRIDX6 NOFINALGRIDX
keywords: grid4 nofinalgrid
keywords: scfconv7
keywords: smallprint printgap noloewdin
keywords: NOSOSCF
formula: C17H21N5O9S2
InChI: InChI=1S/C17H21N5O9S2/c1-29-13-8-14(30-2)20-16(19-13)21-17(24)22-33(27,28)12-7-10(9-18-32(4,25)26)5-6-11(12)15(23)31-3/h5-8,18,21-22H,9H2,1-4H3
54 atoms
S  -0.279963 1.033971 1.323494
S  5.642189 2.75193 -0.790171
O  -1.262541 2.01651 0.904576
O  0.397198 1.183362 2.59226
O  -1.004238 2.444267 -2.290292
O  4.540601 3.704641 -0.831025
O  6.030127 2.097986 -2.033623
O  -1.652921 0.396421 -1.661741
O  0.640225 -1.728841 1.865427
O  -4.932781 -5.370256 0.549079
O  -5.349007 -0.761158 0.215913
N  5.382639 1.539279 0.315562
N  -1.113147 -0.400449 1.299605
N  -1.345364 -2.704488 1.419237
N  -3.135645 -4.035244 0.989681
N  -3.347727 -1.693518 0.805715
C  0.941556 0.884184 0.048249
C  3.249091 0.579132 -0.551738
C  4.679885 0.341693 -0.141409
C  2.253762 0.644172 0.416707
C  0.5906 1.08521 -1.285719
C  2.903485 0.779877 -1.881361
C  1.590382 1.036593 -2.245068
C  -0.822207 1.263766 -1.740582
C  7.045486 3.566557 -0.08441
C  -0.524808 -1.609172 1.554583
C  -2.670256 -2.801596 1.052854
C  -2.3055 2.734124 -2.809867
C  -4.406893 -4.16272 0.638484
C  -4.624187 -1.83584 0.461732
C  -5.227807 -3.077398 0.354587
C  -4.113124 -6.500833 0.831892
C  -4.741843 0.524019 0.324088
H  5.245528 -0.108331 -0.95526
H  4.720115 -0.361289 0.690124
H  2.509887 0.50622 1.458901
H  3.661052 0.73461 -2.652863
H  1.347136 1.189057 -3.288348
H  5.009218 1.910769 1.184153
H  -2.091487 -0.400224 0.977074
H  7.879972 2.872851 -0.019604
H  6.793375 3.945057 0.904721
H  7.304618 4.402137 -0.733773
H  -2.572409 2.052827 -3.617546
H  -2.251262 3.748403 -3.194042
H  -3.061801 2.687114 -2.026296
H  -6.263868 -3.193295 0.071466
H  -3.753735 -6.491747 1.86108
H  -3.261165 -6.562626 0.154611
H  -4.750568 -7.368645 0.683664
H  -4.371408 0.714064 1.332172
H  -3.93508 0.64598 -0.398353
H  -5.528247 1.239761 0.098921
H  -0.88822 -3.588199 1.601704
elementType: S O N C H
totalener: -2407.87320199 hartree
nucrepener: 4045.54337249 hartree
electener: -6453.41657448 hartree
twoeener: 4902.57455661 hartree
cpcmener: -0.05980468 hartree
kineticenergy: 2399.62303153 hartree
xcener: -185.882328595175 hartree
chargesum: -0.0000000
charge: 0.883266 0.815802 -0.508710 -0.492030 -0.263523 -0.529550 -0.540315 -0.422667 -0.464620 -0.292353 -0.291837 -0.218043 -0.199203 -0.141668 -0.427087 -0.425560 -0.146179 -0.053239 -0.043406 0.010741 0.063873 -0.111768 -0.175200 0.418472 -0.229013 0.371788 0.367488 -0.127515 0.415084 0.420773 -0.325951 -0.117198 -0.112491 0.129887 0.129970 0.128700 0.151390 0.147940 0.166335 0.218317 0.134065 0.137435 0.136319 0.122598 0.135182 0.115705 0.144539 0.113609 0.113453 0.131314 0.116675 0.090335 0.139383 0.188690
qa: 0.8833 0.8158 -0.5087 -0.4920 -0.2635 -0.5296 -0.5403 -0.4227 -0.4646 -0.2924 -0.2918 -0.2180 -0.1992 -0.1417 -0.4271 -0.4256 -0.1462 -0.0532 -0.0434 0.0107 0.0639 -0.1118 -0.1752 0.4185 -0.2290 0.3718 0.3675 -0.1275 0.4151 0.4208 -0.3260 -0.1172 -0.1125 0.1299 0.1300 0.1287 0.1514 0.1479 0.1663 0.2183 0.1341 0.1374 0.1363 0.1226 0.1352 0.1157 0.1445 0.1136 0.1135 0.1313 0.1167 0.0903 0.1394 0.1887
va: 5.8217 5.7469 1.9804 2.0095 2.1412 1.9175 1.9198 2.0722 2.0556 2.1298 2.1416 2.9975 3.0874 3.1766 2.9660 2.9726 3.8221 3.6543 3.9047 3.8371 3.7366 3.9273 4.0693 4.1262 3.8935 4.4145 4.2527 3.8643 4.0238 3.9902 3.9298 3.8501 3.8467 1.0084 0.9969 1.0387 1.0077 1.0061 1.0227 1.0539 1.0112 1.0049 1.0082 0.9925 0.9944 0.9899 1.0168 0.9955 0.9955 0.9937 0.9949 1.0040 0.9961 1.0195
dispcorr: -0.032083348 hartree
energy: -2407.905285336914
dipole: 1.10349 -0.89976 0.20373 -1.53988 0.16540 -1.37447 -5.78169 5.32925 -0.45245
magnitude: 1.46130 au
magnitude: 3.71432 debye
