program: Orca
programVersion: 4.2.1
elementType: S S O O O O O O O O O N N N N N C C C C C C C C C C C C C C C C C H H H H H H H H H H H H H H H H H H H H H
charge: 0
multiplicity: 1
keywords: wb97x-d3
keywords: def2-TZVPP
keywords: def2/J RIJCOSX GRIDX6 NOFINALGRIDX
keywords: grid4 nofinalgrid
keywords: scfconv7
keywords: smallprint printgap noloewdin
keywords: NOSOSCF
formula: C17H21N5O9S2
InChI: InChI=1S/C17H21N5O9S2/c1-29-13-8-14(30-2)20-16(19-13)21-17(24)22-33(27,28)12-7-10(9-18-32(4,25)26)5-6-11(12)15(23)31-3/h5-8,18,21-22H,9H2,1-4H3
54 atoms
S  -0.44195 1.849148 1.27791
S  5.193685 -0.075854 -0.206154
O  -1.654819 2.599217 1.009278
O  0.32949 2.130328 2.467981
O  -1.856975 2.992698 -2.311111
O  6.634527 -0.27921 -0.280116
O  4.384449 -0.34514 -1.386056
O  -1.970849 0.914502 -1.492237
O  1.113618 -0.639077 1.622715
O  -3.48736 -5.379096 0.085508
O  -5.05593 -1.029136 0.483058
N  4.848447 1.480428 0.256023
N  -0.943757 0.265999 1.303891
N  -0.614626 -2.028578 1.206436
N  -2.048613 -3.702398 0.655509
N  -2.846442 -1.490746 0.839437
C  0.627886 1.981055 -0.13202
C  2.859111 2.251595 -0.980294
C  4.337479 2.401082 -0.749974
C  1.990945 2.066171 0.089967
C  0.091305 2.097778 -1.415259
C  2.332233 2.361921 -2.257227
C  0.963659 2.300237 -2.473314
C  -1.360832 1.927096 -1.718404
C  4.585036 -1.028734 1.154052
C  -0.069071 -0.781976 1.3981
C  -1.899571 -2.411444 0.886035
C  -3.231259 2.945501 -2.704418
C  -3.272402 -4.101736 0.341093
C  -4.071123 -1.906027 0.531473
C  -4.355975 -3.234412 0.262268
C  -2.389353 -6.285578 0.138498
C  -4.777402 0.343031 0.751688
H  4.531284 3.399371 -0.355408
H  4.8727 2.342881 -1.700739
H  2.387576 1.995544 1.093039
H  2.993142 2.501039 -3.103455
H  0.580925 2.389815 -3.481284
H  5.579232 1.872903 0.837948
H  -1.91518 0.053574 1.036293
H  4.804494 -2.076848 0.954271
H  3.512049 -0.886359 1.251071
H  5.088063 -0.721751 2.069043
H  -3.416126 2.138954 -3.411116
H  -3.436677 3.898045 -3.181845
H  -3.883703 2.830013 -1.840596
H  -5.349954 -3.571866 0.007582
H  -2.799124 -7.257023 -0.125662
H  -1.95673 -6.338581 1.137718
H  -1.610523 -6.019195 -0.576229
H  -5.734032 0.854814 0.685774
H  -4.368619 0.487054 1.752409
H  -4.099597 0.764563 0.009644
H  0.054703 -2.785444 1.255839
elementType: S O N C H
totalener: -2407.87325998 hartree
nucrepener: 4136.29769247 hartree
electener: -6544.17095246 hartree
twoeener: 4993.16603867 hartree
cpcmener: -0.05668423 hartree
kineticenergy: 2399.63588414 hartree
xcener: -185.887482375970 hartree
chargesum: 0.0000000
charge: 0.887762 0.832129 -0.510324 -0.494049 -0.268852 -0.540334 -0.531316 -0.423930 -0.472835 -0.292663 -0.291377 -0.250982 -0.199106 -0.141212 -0.427276 -0.420570 -0.150547 0.005682 -0.009179 -0.019984 0.066211 -0.130892 -0.167834 0.422616 -0.234367 0.384841 0.366592 -0.126563 0.414233 0.420109 -0.327417 -0.115654 -0.111318 0.128114 0.122624 0.124934 0.141386 0.148363 0.175637 0.218310 0.135873 0.120835 0.133603 0.121196 0.134335 0.117393 0.144733 0.131336 0.113093 0.112788 0.139129 0.118523 0.087612 0.188587
qa: 0.8878 0.8321 -0.5103 -0.4940 -0.2689 -0.5403 -0.5313 -0.4239 -0.4728 -0.2927 -0.2914 -0.2510 -0.1991 -0.1412 -0.4273 -0.4206 -0.1505 0.0057 -0.0092 -0.0200 0.0662 -0.1309 -0.1678 0.4226 -0.2344 0.3848 0.3666 -0.1266 0.4142 0.4201 -0.3274 -0.1157 -0.1113 0.1281 0.1226 0.1249 0.1414 0.1484 0.1756 0.2183 0.1359 0.1208 0.1336 0.1212 0.1343 0.1174 0.1447 0.1313 0.1131 0.1128 0.1391 0.1185 0.0876 0.1886
va: 5.8194 5.7803 1.9792 2.0066 2.1392 1.9360 1.9265 2.0692 2.0436 2.1292 2.1396 2.9806 3.0911 3.1800 2.9671 2.9676 3.8201 3.6821 3.8622 3.8369 3.7210 3.9809 4.0291 4.1201 3.8746 4.3801 4.2509 3.8646 4.0263 3.9909 3.9328 3.8499 3.8468 0.9928 1.0052 1.0581 1.0020 1.0071 1.0183 1.0541 1.0128 1.0232 1.0108 0.9934 0.9947 0.9890 1.0166 0.9936 0.9955 0.9961 0.9960 0.9944 1.0015 1.0197
dispcorr: -0.033130766 hartree
energy: -2407.906390750205
dipole: -4.42750 3.28901 -1.13849 -4.04097 3.89772 -0.14325 -5.68860 4.73709 -0.95151
magnitude: 1.49066 au
magnitude: 3.78895 debye
