program: Orca
programVersion: 4.2.1
elementType: S S O O O O O O O O O N N N N N C C C C C C C C C C C C C C C C C H H H H H H H H H H H H H H H H H H H H H
charge: 0
multiplicity: 1
keywords: wb97x-d3
keywords: def2-TZVPP
keywords: def2/J RIJCOSX GRIDX6 NOFINALGRIDX
keywords: grid4 nofinalgrid
keywords: scfconv7
keywords: smallprint printgap noloewdin
keywords: NOSOSCF
formula: C17H21N5O9S2
InChI: InChI=1S/C17H21N5O9S2/c1-29-13-8-14(30-2)20-16(19-13)21-17(24)22-33(27,28)12-7-10(9-18-32(4,25)26)5-6-11(12)15(23)31-3/h5-8,18,21-22H,9H2,1-4H3
54 atoms
S  -0.455254 1.357238 -1.782535
S  5.169593 -0.064776 0.270634
O  0.286529 1.220951 -3.015852
O  -1.660182 2.165081 -1.750409
O  -1.776787 3.683979 1.199868
O  4.364401 0.14426 1.465024
O  6.607049 -0.254446 0.417452
O  -1.924946 1.451952 1.180796
O  1.090566 -1.11376 -1.32796
O  -3.519886 -5.206418 1.500162
O  -5.058745 -1.102245 -0.023714
N  4.848273 1.210929 -0.741685
N  -0.958847 -0.141399 -1.270516
N  -0.635013 -2.306384 -0.49904
N  -2.07428 -3.756257 0.493438
N  -2.857058 -1.664601 -0.26523
C  0.649471 1.938112 -0.521128
C  2.902952 2.434895 0.145272
C  4.377019 2.45615 -0.150632
C  2.007753 1.913638 -0.782236
C  0.144978 2.497448 0.653698
C  2.408073 2.987698 1.315587
C  1.043942 3.032646 1.563067
C  -1.30278 2.46949 1.017856
C  4.534619 -1.446799 -0.634795
C  -0.089548 -1.175295 -1.056799
C  -1.918347 -2.575025 -0.074513
C  -3.145405 3.802169 1.598366
C  -3.297108 -4.044124 0.915027
C  -4.080942 -1.969928 0.154593
C  -4.372449 -3.174941 0.771833
C  -2.432972 -6.112084 1.667262
C  -4.776091 0.139171 -0.665027
H  4.935636 2.750602 0.741093
H  4.574193 3.225762 -0.89816
H  2.379496 1.496513 -1.707763
H  3.090402 3.394071 2.051509
H  0.685504 3.469363 2.485828
H  5.572534 1.334031 -1.440078
H  -1.92746 -0.252439 -0.939629
H  4.734214 -2.347398 -0.055046
H  5.040314 -1.515776 -1.596108
H  3.464251 -1.329442 -0.782527
H  -3.338601 4.867491 1.682927
H  -3.323661 3.32366 2.561076
H  -3.811846 3.374971 0.849136
H  -5.366045 -3.42164 1.11651
H  -1.640704 -5.68452 2.282044
H  -2.01525 -6.42319 0.709556
H  -2.849425 -6.978965 2.17372
H  -4.386948 -0.004465 -1.67368
H  -5.727492 0.661132 -0.726921
H  -4.080281 0.74082 -0.080676
H  0.030796 -3.05047 -0.336467
elementType: S O N C H
totalener: -2407.87362985 hartree
nucrepener: 4130.87574767 hartree
electener: -6538.74937753 hartree
twoeener: 4987.73525292 hartree
cpcmener: -0.05686236 hartree
kineticenergy: 2399.62697647 hartree
xcener: -185.885783408358 hartree
chargesum: -0.0000000
charge: 0.887284 0.832938 -0.493071 -0.510341 -0.267760 -0.530831 -0.541259 -0.425408 -0.473765 -0.292709 -0.291630 -0.250405 -0.198975 -0.141006 -0.427525 -0.424904 -0.144662 0.005662 -0.010904 -0.023385 0.064237 -0.127052 -0.166880 0.421568 -0.234523 0.386313 0.368760 -0.127005 0.415495 0.421877 -0.329444 -0.115693 -0.113434 0.122347 0.129134 0.123001 0.140954 0.147674 0.175005 0.220049 0.135330 0.133521 0.121434 0.134855 0.120918 0.117017 0.144811 0.113469 0.112700 0.131049 0.117408 0.139454 0.089939 0.188370
qa: 0.8873 0.8329 -0.4931 -0.5103 -0.2678 -0.5308 -0.5413 -0.4254 -0.4738 -0.2927 -0.2916 -0.2504 -0.1990 -0.1410 -0.4275 -0.4249 -0.1447 0.0057 -0.0109 -0.0234 0.0642 -0.1271 -0.1669 0.4216 -0.2345 0.3863 0.3688 -0.1270 0.4155 0.4219 -0.3294 -0.1157 -0.1134 0.1223 0.1291 0.1230 0.1410 0.1477 0.1750 0.2200 0.1353 0.1335 0.1214 0.1349 0.1209 0.1170 0.1448 0.1135 0.1127 0.1310 0.1174 0.1395 0.0899 0.1884
va: 5.8170 5.7784 2.0084 1.9790 2.1389 1.9272 1.9347 2.0691 2.0414 2.1297 2.1406 2.9794 3.0953 3.1812 2.9659 2.9676 3.8115 3.6852 3.8622 3.8429 3.7259 3.9723 4.0274 4.1222 3.8747 4.3790 4.2492 3.8644 4.0232 3.9878 3.9327 3.8501 3.8470 1.0049 0.9928 1.0594 1.0024 1.0072 1.0185 1.0507 1.0130 1.0105 1.0230 0.9942 0.9933 0.9896 1.0167 0.9956 0.9957 0.9937 0.9945 0.9960 1.0029 1.0198
dispcorr: -0.033005682 hartree
energy: -2407.906635536554
dipole: -4.27606 3.19864 -1.07741 -2.27240 2.32794 0.05553 6.38317 -5.57307 0.81010
magnitude: 1.34913 au
magnitude: 3.42922 debye
