program: Orca
programVersion: 4.2.1
elementType: S S O O O O O O O O O N N N N N C C C C C C C C C C C C C C C C C H H H H H H H H H H H H H H H H H H H H H
charge: 0
multiplicity: 1
keywords: wb97x-d3
keywords: def2-TZVPP
keywords: def2/J RIJCOSX GRIDX6 NOFINALGRIDX
keywords: grid4 nofinalgrid
keywords: scfconv7
keywords: smallprint printgap noloewdin
keywords: NOSOSCF
formula: C17H21N5O9S2
InChI: InChI=1S/C17H21N5O9S2/c1-29-13-8-14(30-2)20-16(19-13)21-17(24)22-33(27,28)12-7-10(9-18-32(4,25)26)5-6-11(12)15(23)31-3/h5-8,18,21-22H,9H2,1-4H3
54 atoms
S  -0.542352 1.891427 1.318565
S  4.986161 -0.203146 -0.657167
O  -1.747837 2.595521 0.922896
O  0.09401 2.201485 2.578333
O  -1.67604 3.10929 -2.262413
O  5.992408 -1.05523 -0.039675
O  5.159713 0.21976 -2.04126
O  -1.748829 0.961035 -1.63966
O  1.049562 -0.538231 1.873351
O  -3.370815 -5.512963 0.565595
O  -4.978473 -1.176837 0.18901
N  4.830318 1.118165 0.333497
N  -0.983384 0.290908 1.293572
N  -0.60954 -1.995885 1.41557
N  -1.987517 -3.749818 0.993857
N  -2.804225 -1.54603 0.790625
C  0.657476 2.065336 0.023064
C  2.953572 2.359733 -0.615129
C  4.408217 2.390684 -0.237976
C  1.992402 2.149755 0.369805
C  0.242341 2.206347 -1.302723
C  2.546978 2.504296 -1.931697
C  1.201877 2.443253 -2.272596
C  -1.176712 2.016186 -1.729502
C  3.419439 -1.021921 -0.537136
C  -0.104129 -0.724896 1.553203
C  -1.862297 -2.437002 1.048234
C  -3.026322 3.05181 -2.731044
C  -3.180044 -4.209076 0.643943
C  -3.997839 -2.021007 0.446505
C  -4.255495 -3.37842 0.351473
C  -2.284271 -6.386246 0.859719
C  -4.725866 0.22399 0.264926
H  4.569855 3.134468 0.542305
H  5.016683 2.69118 -1.093895
H  2.297953 2.050345 1.402476
H  3.282096 2.666289 -2.709401
H  0.909311 2.556558 -3.308114
H  5.61885 1.186533 0.966985
H  -1.924385 0.039883 0.958926
H  3.207406 -1.252308 0.50276
H  3.489024 -1.941935 -1.117231
H  2.632888 -0.3974 -0.952999
H  -3.237618 4.031794 -3.148368
H  -3.716406 2.854679 -1.910438
H  -3.150837 2.29356 -3.503361
H  -5.224353 -3.763681 0.069029
H  -2.671568 -7.392355 0.721373
H  -1.941628 -6.27272 1.888402
H  -1.444397 -6.229624 0.182599
H  -4.423952 0.527792 1.268073
H  -3.973246 0.53204 -0.46012
H  -5.669347 0.706057 0.022121
H  0.058704 -2.730825 1.606539
elementType: S O N C H
totalener: -2407.87418306 hartree
nucrepener: 4150.20093775 hartree
electener: -6558.07512081 hartree
twoeener: 5005.46790624 hartree
cpcmener: -0.05473141 hartree
kineticenergy: 2399.63444841 hartree
xcener: -185.887533781173 hartree
chargesum: -0.0000000
charge: 0.886490 0.828300 -0.508086 -0.488965 -0.264849 -0.546386 -0.525697 -0.421644 -0.459067 -0.292303 -0.292165 -0.233031 -0.196764 -0.140588 -0.428665 -0.427628 -0.132548 -0.142327 -0.015921 0.021251 0.069270 -0.055966 -0.166330 0.413303 -0.243171 0.369080 0.370095 -0.124544 0.414727 0.421225 -0.327526 -0.115896 -0.115990 0.133851 0.122249 0.117963 0.142511 0.149672 0.171218 0.219592 0.130294 0.151921 0.120396 0.135614 0.115511 0.121152 0.145034 0.131232 0.113416 0.113079 0.114888 0.094480 0.139892 0.188352
qa: 0.8865 0.8283 -0.5081 -0.4890 -0.2648 -0.5464 -0.5257 -0.4216 -0.4591 -0.2923 -0.2922 -0.2330 -0.1968 -0.1406 -0.4287 -0.4276 -0.1325 -0.1423 -0.0159 0.0213 0.0693 -0.0560 -0.1663 0.4133 -0.2432 0.3691 0.3701 -0.1245 0.4147 0.4212 -0.3275 -0.1159 -0.1160 0.1339 0.1222 0.1180 0.1425 0.1497 0.1712 0.2196 0.1303 0.1519 0.1204 0.1356 0.1155 0.1212 0.1450 0.1312 0.1134 0.1131 0.1149 0.0945 0.1399 0.1884
va: 5.8193 5.7898 1.9818 2.0141 2.1416 1.9330 1.9261 2.0774 2.0562 2.1302 2.1412 2.9659 3.0951 3.1770 2.9652 2.9710 3.7842 3.6917 3.8714 3.7701 3.6988 3.8822 4.0529 4.1438 3.8612 4.4047 4.2473 3.8587 4.0255 3.9906 3.9304 3.8500 3.8444 0.9946 1.0082 1.0566 1.0080 1.0049 1.0234 1.0507 1.0298 1.0088 1.0084 0.9945 0.9911 0.9938 1.0167 0.9936 0.9957 0.9958 0.9954 1.0055 0.9959 1.0196
dispcorr: -0.034524508 hartree
energy: -2407.908707572608
dipole: -6.39014 4.48652 -1.90363 -4.27738 4.12442 -0.15296 -8.09047 6.64980 -1.44066
magnitude: 2.39221 au
magnitude: 6.08053 debye
