program: Orca
programVersion: 4.2.1
elementType: S S O O O O O O O O O N N N N N C C C C C C C C C C C C C C C C C H H H H H H H H H H H H H H H H H H H H H
charge: 0
multiplicity: 1
keywords: wb97x-d3
keywords: def2-TZVPP
keywords: def2/J RIJCOSX GRIDX6 NOFINALGRIDX
keywords: grid4 nofinalgrid
keywords: scfconv7
keywords: smallprint printgap noloewdin
keywords: NOSOSCF
formula: C17H21N5O9S2
InChI: InChI=1S/C17H21N5O9S2/c1-29-13-8-14(30-2)20-16(19-13)21-17(24)22-33(27,28)12-7-10(9-18-32(4,25)26)5-6-11(12)15(23)31-3/h5-8,18,21-22H,9H2,1-4H3
54 atoms
S  -0.660225 1.515481 -1.749748
S  4.986274 -0.222023 0.330454
O  -0.11101 1.471788 -3.085764
O  -1.838623 2.315677 -1.474131
O  -1.520869 3.674983 1.448475
O  5.505877 0.526537 1.464869
O  5.731095 -1.350639 -0.203744
O  -1.678657 1.4422 1.427946
O  0.911746 -0.987643 -1.729146
O  -3.311903 -5.335007 1.31213
O  -4.983633 -1.089696 0.464277
N  4.827503 0.849236 -0.904993
N  -1.089535 -0.015872 -1.27042
N  -0.688274 -2.241692 -0.752946
N  -1.997854 -3.784651 0.275411
N  -2.845711 -1.623507 -0.142585
C  0.625333 1.997337 -0.626827
C  2.967181 2.356038 -0.229268
C  4.397662 2.220519 -0.681111
C  1.934617 1.946996 -1.067478
C  0.305449 2.482403 0.641791
C  2.65411 2.84697 1.029118
C  1.335287 2.924783 1.45629
C  -1.082982 2.461661 1.195268
C  3.372554 -0.826933 0.765029
C  -0.214699 -1.068521 -1.287967
C  -1.904585 -2.55069 -0.182724
C  -2.829043 3.796147 2.015848
C  -3.154861 -4.116367 0.829745
C  -4.004248 -1.971915 0.409738
C  -4.226179 -3.236263 0.929764
C  -2.227034 -6.254767 1.223998
C  -4.774282 0.214219 -0.072535
H  5.068489 2.691893 0.034925
H  4.543283 2.739362 -1.628626
H  2.159675 1.588547 -2.063049
H  3.443688 3.176023 1.692709
H  1.117362 3.311154 2.443112
H  4.553238 0.428214 -1.784377
H  -2.003644 -0.157018 -0.817761
H  3.505082 -1.597619 1.523941
H  2.894248 -1.257689 -0.111085
H  2.761547 -0.025389 1.171332
H  -2.990627 4.859562 2.164272
H  -2.898391 3.280992 2.972924
H  -3.587464 3.409235 1.33589
H  -5.167093 -3.518418 1.379127
H  -1.352122 -5.901278 1.769772
H  -1.948347 -6.452832 0.188916
H  -2.585106 -7.174168 1.679793
H  -3.984762 0.743698 0.460435
H  -4.546639 0.181617 -1.138625
H  -5.712607 0.74403 0.069855
H  -0.022981 -3.003505 -0.771783
elementType: S O N C H
totalener: -2407.87523377 hartree
nucrepener: 4153.35012525 hartree
electener: -6561.22535902 hartree
twoeener: 5007.80488204 hartree
cpcmener: -0.05657433 hartree
kineticenergy: 2399.62668686 hartree
xcener: -185.890913208531 hartree
chargesum: 0.0000000
charge: 0.884621 0.832760 -0.487552 -0.507178 -0.264594 -0.532121 -0.541300 -0.420553 -0.463470 -0.291953 -0.291233 -0.235393 -0.196457 -0.139735 -0.427980 -0.427120 -0.132332 -0.121451 -0.006227 0.007094 0.070787 -0.081684 -0.158636 0.415257 -0.271308 0.371185 0.370119 -0.126370 0.413192 0.420224 -0.325659 -0.116520 -0.113258 0.121443 0.133983 0.123994 0.144310 0.150007 0.177946 0.219024 0.151734 0.132386 0.125316 0.135740 0.121472 0.117018 0.145453 0.113737 0.113174 0.131650 0.091258 0.117165 0.138719 0.189317
qa: 0.8846 0.8328 -0.4876 -0.5072 -0.2646 -0.5321 -0.5413 -0.4206 -0.4635 -0.2920 -0.2912 -0.2354 -0.1965 -0.1397 -0.4280 -0.4271 -0.1323 -0.1215 -0.0062 0.0071 0.0708 -0.0817 -0.1586 0.4153 -0.2713 0.3712 0.3701 -0.1264 0.4132 0.4202 -0.3257 -0.1165 -0.1133 0.1214 0.1340 0.1240 0.1443 0.1500 0.1779 0.2190 0.1517 0.1324 0.1253 0.1357 0.1215 0.1170 0.1455 0.1137 0.1132 0.1317 0.0913 0.1172 0.1387 0.1893
va: 5.8189 5.8230 2.0150 1.9829 2.1421 1.9269 1.9378 2.0781 2.0505 2.1305 2.1414 3.0158 3.0982 3.1807 2.9658 2.9694 3.7971 3.6590 3.8706 3.7806 3.7032 3.8886 4.0402 4.1422 3.8637 4.4002 4.2466 3.8601 4.0281 3.9901 3.9319 3.8491 3.8468 1.0086 0.9954 1.0448 1.0055 1.0048 1.0209 1.0516 1.0122 1.0293 1.0059 0.9941 0.9937 0.9904 1.0164 0.9955 0.9957 0.9937 1.0030 0.9943 0.9964 1.0190
dispcorr: -0.034670745 hartree
energy: -2407.909904514861
dipole: -6.64890 4.04470 -2.60420 -1.62057 1.92748 0.30691 10.08578 -8.38530 1.70048
magnitude: 3.12533 au
magnitude: 7.94395 debye
