program: Orca
programVersion: 4.2.1
elementType: S S O O O O O O O O O N N N N N C C C C C C C C C C C C C C C C C H H H H H H H H H H H H H H H H H H H H H
charge: 0
multiplicity: 1
keywords: wb97x-d3
keywords: def2-TZVPP
keywords: def2/J RIJCOSX GRIDX6 NOFINALGRIDX
keywords: grid4 nofinalgrid
keywords: scfconv7
keywords: smallprint printgap noloewdin
keywords: NOSOSCF
formula: C17H21N5O9S2
InChI: InChI=1S/C17H21N5O9S2/c1-29-13-8-14(30-2)20-16(19-13)21-17(24)22-33(27,28)12-7-10(9-18-32(4,25)26)5-6-11(12)15(23)31-3/h5-8,18,21-22H,9H2,1-4H3
54 atoms
S  0.036581 0.561735 1.303776
S  5.56661 2.731625 0.238366
O  -0.98432 1.582583 1.410916
O  0.946059 0.309052 2.392807
O  -1.218624 3.078832 -1.745547
O  5.394543 3.317383 -1.078052
O  6.79816 2.893178 0.983544
O  -1.810546 0.960072 -1.345278
O  0.991387 -2.207089 0.698289
O  -4.809929 -5.627769 -0.051596
O  -5.206001 -1.065988 0.714057
N  5.293841 1.083183 0.139498
N  -0.805757 -0.828128 0.946796
N  -1.072206 -3.086568 0.473302
N  -2.936393 -4.354516 0.211661
N  -3.14209 -2.035016 0.59818
C  1.016083 0.892167 -0.146948
C  3.210187 0.921126 -1.130566
C  4.666462 0.550957 -1.059555
C  2.358916 0.571156 -0.087978
C  0.486218 1.574352 -1.24389
C  2.699051 1.633631 -2.202129
C  1.350591 1.955074 -2.25957
C  -0.976222 1.819386 -1.419531
C  4.222352 3.291314 1.26254
C  -0.201188 -2.033591 0.712416
C  -2.445483 -3.146312 0.429707
C  -2.577569 3.429365 -1.980615
C  -4.256447 -4.44685 0.162139
C  -4.465516 -2.144101 0.546859
C  -5.101396 -3.355554 0.32643
C  -3.961339 -6.752445 -0.215634
C  -4.561359 0.184459 0.923868
H  5.176499 0.858868 -1.976035
H  4.753821 -0.535101 -0.992063
H  2.752512 0.059944 0.779897
H  3.358874 1.955164 -2.997348
H  0.972109 2.508692 -3.107862
H  6.106743 0.574686 0.460919
H  -1.820415 -0.759403 0.817543
H  4.256287 2.772001 2.216518
H  3.273853 3.103586 0.766021
H  4.353571 4.361348 1.41486
H  -3.007785 2.849498 -2.797252
H  -2.57178 4.482882 -2.244399
H  -3.181245 3.282107 -1.085217
H  -6.175906 -3.444612 0.285517
H  -3.348827 -6.930338 0.668698
H  -3.302694 -6.640744 -1.077353
H  -4.624254 -7.598975 -0.373511
H  -3.937539 0.467167 0.07595
H  -5.363608 0.908107 1.040671
H  -3.951604 0.182432 1.828523
H  -0.608823 -3.968627 0.315807
totalener: -2407.83790569 hartree
nucrepener: 4058.65119538 hartree
electener: -6466.48910107 hartree
twoeener: 4913.53777971 hartree
kineticenergy: 2399.69023450 hartree
xcener: -185.884632572899 hartree
chargesum: -0.0000000
charge: 0.869217 0.803830 -0.473817 -0.436513 -0.256267 -0.462825 -0.470798 -0.380493 -0.390120 -0.264322 -0.264587 -0.243865 -0.203099 -0.167429 -0.409124 -0.422804 -0.168951 -0.099531 -0.047803 -0.018480 0.072436 -0.035158 -0.159949 0.398775 -0.255023 0.350050 0.362974 -0.137042 0.385491 0.401737 -0.302598 -0.125021 -0.130270 0.118608 0.124145 0.128964 0.120016 0.125696 0.144104 0.214384 0.127900 0.115557 0.134285 0.113212 0.125089 0.112374 0.127479 0.107852 0.107520 0.123791 0.109053 0.125184 0.109983 0.166183
qa: 0.8692 0.8038 -0.4738 -0.4365 -0.2563 -0.4628 -0.4708 -0.3805 -0.3901 -0.2643 -0.2646 -0.2439 -0.2031 -0.1674 -0.4091 -0.4228 -0.1690 -0.0995 -0.0478 -0.0185 0.0724 -0.0352 -0.1599 0.3988 -0.2550 0.3501 0.3630 -0.1370 0.3855 0.4017 -0.3026 -0.1250 -0.1303 0.1186 0.1241 0.1290 0.1200 0.1257 0.1441 0.2144 0.1279 0.1156 0.1343 0.1132 0.1251 0.1124 0.1275 0.1079 0.1075 0.1238 0.1091 0.1252 0.1100 0.1662
va: 5.8389 5.8215 2.0191 2.0736 2.1399 1.9953 2.0208 2.1171 2.1307 2.1488 2.1610 2.9610 3.1064 3.1631 2.9703 2.9727 3.8826 3.6960 3.9192 3.7760 3.7183 3.9419 4.0776 4.1444 3.8853 4.4081 4.2450 3.8912 4.0573 4.0195 3.9373 3.8776 3.8691 1.0077 0.9919 1.0577 1.0160 1.0195 1.0438 1.0472 1.0191 1.0102 1.0121 0.9937 0.9953 0.9927 1.0225 0.9972 0.9968 0.9938 1.0040 0.9953 0.9976 1.0373
dispcorr: -0.032605976 hartree
energy: -2407.870511662440
dipole: -7.99566 6.12109 -1.87457 -0.17942 -0.91002 -1.08945 -6.38348 4.98448 -1.39900
magnitude: 2.58034 au
magnitude: 6.55869 debye
