program: Orca
programVersion: 4.2.1
elementType: S S O O O O O O O O O N N N N N C C C C C C C C C C C C C C C C C H H H H H H H H H H H H H H H H H H H H H
charge: 0
multiplicity: 1
keywords: wb97x-d3
keywords: def2-TZVPP
keywords: def2/J RIJCOSX GRIDX6 NOFINALGRIDX
keywords: grid4 nofinalgrid
keywords: scfconv7
keywords: smallprint printgap noloewdin
keywords: NOSOSCF
formula: C17H21N5O9S2
InChI: InChI=1S/C17H21N5O9S2/c1-29-13-8-14(30-2)20-16(19-13)21-17(24)22-33(27,28)12-7-10(9-18-32(4,25)26)5-6-11(12)15(23)31-3/h5-8,18,21-22H,9H2,1-4H3
54 atoms
S  -0.291755 1.483431 1.164925
S  5.699063 0.486664 0.555765
O  -1.469775 2.323156 1.181664
O  0.653303 1.506747 2.252639
O  -1.947635 3.309346 -2.191301
O  6.705415 1.050711 1.42964
O  6.047649 -0.368287 -0.562187
O  -2.213076 1.218406 -1.447602
O  1.111112 -1.144124 0.839517
O  -4.028867 -5.480148 0.04384
O  -5.193734 -1.041563 0.742611
N  4.82014 1.773182 -0.025543
N  -0.890045 -0.062278 0.98678
N  -0.777083 -2.355832 0.643067
N  -2.399365 -3.913692 0.34625
N  -2.994462 -1.655986 0.695084
C  0.608793 1.782464 -0.343912
C  2.767621 1.979871 -1.385837
C  4.267797 1.811566 -1.356075
C  1.988412 1.703333 -0.273024
C  -0.032505 2.172294 -1.517601
C  2.13567 2.389402 -2.551945
C  0.756688 2.495773 -2.614492
C  -1.515816 2.166707 -1.68254
C  4.528727 -0.399301 1.563215
C  -0.095659 -1.164153 0.831138
C  -2.121267 -2.63933 0.560206
C  -3.347195 3.417563 -2.425916
C  -3.684197 -4.223077 0.260458
C  -4.280123 -1.982509 0.609001
C  -4.701023 -3.284265 0.387433
C  -3.001465 -6.44818 -0.097197
C  -4.773081 0.300723 0.953019
H  4.739603 2.608829 -1.937264
H  4.529783 0.883045 -1.867855
H  2.4609 1.431659 0.658546
H  2.724317 2.632865 -3.42868
H  0.289755 2.821831 -3.533903
H  5.085441 2.651295 0.394806
H  -1.899696 -0.173457 0.845444
H  4.168488 0.248715 2.358776
H  5.04905 -1.253174 1.994589
H  3.692308 -0.746663 0.961677
H  -3.50271 4.407098 -2.845391
H  -3.909078 3.324248 -1.496697
H  -3.697629 2.661824 -3.128989
H  -5.744683 -3.54889 0.31722
H  -2.38728 -6.521212 0.800665
H  -2.352307 -6.228748 -0.945343
H  -3.510684 -7.393239 -0.265858
H  -4.186644 0.405051 1.866877
H  -4.192327 0.678683 0.111842
H  -5.687615 0.879351 1.051645
H  -0.172804 -3.15486 0.524571
totalener: -2407.83942398 hartree
nucrepener: 4072.39118935 hartree
electener: -6480.23061333 hartree
twoeener: 4927.19752982 hartree
kineticenergy: 2399.67944456 hartree
xcener: -185.890229495751 hartree
chargesum: -0.0000000
charge: 0.873296 0.813214 -0.470671 -0.438991 -0.256766 -0.470447 -0.466318 -0.383479 -0.419510 -0.264288 -0.264242 -0.276954 -0.206944 -0.162577 -0.409159 -0.420035 -0.247676 0.026678 -0.068038 0.043290 0.089202 -0.138804 -0.156195 0.401277 -0.267051 0.366205 0.364131 -0.135802 0.385348 0.403542 -0.302939 -0.124708 -0.130452 0.105966 0.127256 0.152455 0.118675 0.123761 0.160127 0.215774 0.123503 0.133300 0.126051 0.124823 0.113016 0.112873 0.128177 0.108036 0.107701 0.123734 0.110172 0.108708 0.125749 0.166008
qa: 0.8733 0.8132 -0.4707 -0.4390 -0.2568 -0.4704 -0.4663 -0.3835 -0.4195 -0.2643 -0.2642 -0.2770 -0.2069 -0.1626 -0.4092 -0.4200 -0.2477 0.0267 -0.0680 0.0433 0.0892 -0.1388 -0.1562 0.4013 -0.2671 0.3662 0.3641 -0.1358 0.3853 0.4035 -0.3029 -0.1247 -0.1305 0.1060 0.1273 0.1525 0.1187 0.1238 0.1601 0.2158 0.1235 0.1333 0.1261 0.1248 0.1130 0.1129 0.1282 0.1080 0.1077 0.1237 0.1102 0.1087 0.1257 0.1660
va: 5.8387 5.8407 2.0249 2.0705 2.1391 2.0141 1.9997 2.1107 2.1021 2.1493 2.1613 3.0040 3.1122 3.1593 2.9714 2.9719 4.0026 3.6853 3.9222 3.7835 3.7092 4.0314 4.0679 4.1340 3.8746 4.3815 4.2411 3.8909 4.0568 4.0167 3.9375 3.8769 3.8679 0.9957 1.0141 1.0196 1.0076 1.0196 1.0344 1.0469 1.0168 1.0138 1.0255 0.9953 0.9927 0.9937 1.0222 0.9969 0.9971 0.9939 0.9974 1.0031 0.9953 1.0379
dispcorr: -0.032169774 hartree
energy: -2407.871593755286
dipole: -8.22787 5.88005 -2.34782 -3.07565 2.93483 -0.14082 -7.57341 5.80941 -1.76401
magnitude: 2.94003 au
magnitude: 7.47297 debye
