program: Orca
programVersion: 4.2.1
elementType: S S O O O O O O O O O N N N N N C C C C C C C C C C C C C C C C C H H H H H H H H H H H H H H H H H H H H H
charge: 0
multiplicity: 1
keywords: wb97x-d3
keywords: def2-TZVPP
keywords: def2/J RIJCOSX GRIDX6 NOFINALGRIDX
keywords: grid4 nofinalgrid
keywords: scfconv7
keywords: smallprint printgap noloewdin
keywords: NOSOSCF
formula: C17H21N5O9S2
InChI: InChI=1S/C17H21N5O9S2/c1-29-13-8-14(30-2)20-16(19-13)21-17(24)22-33(27,28)12-7-10(9-18-32(4,25)26)5-6-11(12)15(23)31-3/h5-8,18,21-22H,9H2,1-4H3
54 atoms
S  -0.530287 1.808287 1.403653
S  5.136855 -0.00942 -0.632424
O  -1.728675 2.544585 1.061704
O  0.160095 2.044663 2.645866
O  -1.559513 2.925819 -2.491403
O  6.275166 -0.745189 -0.121033
O  5.113317 0.4917 -1.995099
O  -1.795115 0.958922 -1.457236
O  1.04971 -0.726903 1.646609
O  -3.63535 -5.471039 0.433474
O  -5.120858 -1.0724 0.42977
N  4.899173 1.270776 0.41946
N  -1.00075 0.211547 1.327092
N  -0.708719 -2.0900 1.27989
N  -2.168671 -3.777651 0.861363
N  -2.927818 -1.543251 0.854752
C  0.652187 2.005706 0.083811
C  2.948029 2.406101 -0.517259
C  4.392835 2.524826 -0.113819
C  1.980825 2.13156 0.444168
C  0.25071 2.163167 -1.245018
C  2.556986 2.55419 -1.837294
C  1.220538 2.450402 -2.194301
C  -1.151354 1.940669 -1.707728
C  3.677939 -0.994134 -0.387016
C  -0.13431 -0.838214 1.438875
C  -1.997542 -2.472979 0.98557
C  -2.867223 2.808151 -3.040234
C  -3.398226 -4.178913 0.575261
C  -4.156245 -1.96063 0.568115
C  -4.464778 -3.30271 0.41231
C  -2.555256 -6.378002 0.584469
C  -4.806704 0.308286 0.564677
H  4.481018 3.256365 0.691432
H  4.986121 2.897969 -0.953012
H  2.269272 2.011327 1.479544
H  3.300743 2.745305 -2.599416
H  0.937452 2.5759 -3.230357
H  5.684872 1.357053 1.050202
H  -1.960916 0.010543 1.027528
H  3.779668 -1.880123 -1.01193
H  2.796336 -0.431561 -0.680745
H  3.599772 -1.274411 0.658963
H  -2.963538 1.918573 -3.662911
H  -3.015975 3.696602 -3.64684
H  -3.622359 2.773986 -2.25499
H  -5.462031 -3.642175 0.178989
H  -2.977711 -7.366046 0.422515
H  -2.120168 -6.327772 1.582943
H  -1.767762 -6.19517 -0.147232
H  -5.747424 0.835202 0.429804
H  -4.408094 0.540883 1.553016
H  -4.094217 0.636115 -0.192367
H  -0.055071 -2.85307 1.368504
totalener: -2407.83890634 hartree
nucrepener: 4133.20458361 hartree
electener: -6541.04348995 hartree
twoeener: 4988.00825356 hartree
kineticenergy: 2399.69417203 hartree
xcener: -185.885829984779 hartree
chargesum: -0.0000000
charge: 0.876505 0.806171 -0.472254 -0.435877 -0.256591 -0.473666 -0.467655 -0.382565 -0.407192 -0.263981 -0.264402 -0.234143 -0.199785 -0.165774 -0.409124 -0.417464 -0.187572 -0.138132 -0.057093 0.026387 0.077280 -0.020747 -0.162346 0.397089 -0.243135 0.353147 0.360918 -0.135039 0.385638 0.404410 -0.303352 -0.124705 -0.124115 0.120000 0.120980 0.127755 0.123923 0.124825 0.141316 0.212305 0.130861 0.106136 0.129392 0.113269 0.125107 0.111653 0.128571 0.123858 0.108014 0.107229 0.126137 0.110742 0.102532 0.164560
qa: 0.8765 0.8062 -0.4723 -0.4359 -0.2566 -0.4737 -0.4677 -0.3826 -0.4072 -0.2640 -0.2644 -0.2341 -0.1998 -0.1658 -0.4091 -0.4175 -0.1876 -0.1381 -0.0571 0.0264 0.0773 -0.0207 -0.1623 0.3971 -0.2431 0.3531 0.3609 -0.1350 0.3856 0.4044 -0.3034 -0.1247 -0.1241 0.1200 0.1210 0.1278 0.1239 0.1248 0.1413 0.2123 0.1309 0.1061 0.1294 0.1133 0.1251 0.1117 0.1286 0.1239 0.1080 0.1072 0.1261 0.1107 0.1025 0.1646
va: 5.8335 5.8169 2.0215 2.0753 2.1412 2.0189 1.9902 2.1103 2.1083 2.1491 2.1613 2.9608 3.1144 3.1637 2.9725 2.9732 3.9235 3.6972 3.9335 3.7551 3.6884 3.9147 4.0847 4.1381 3.8867 4.3980 4.2465 3.8920 4.0578 4.0154 3.9387 3.8770 3.8695 0.9921 1.0063 1.0527 1.0175 1.0195 1.0453 1.0523 1.0117 1.0114 1.0260 0.9938 0.9953 0.9918 1.0221 0.9941 0.9969 0.9971 0.9952 0.9977 1.0023 1.0385
dispcorr: -0.033938535 hartree
energy: -2407.872844877992
dipole: -6.14490 4.55440 -1.59050 -4.45838 4.17161 -0.28678 -8.26223 7.21392 -1.04831
magnitude: 1.92637 au
magnitude: 4.89645 debye
