program: Orca
programVersion: 4.2.1
elementType: S S O O O O O O O O O N N N N N C C C C C C C C C C C C C C C C C H H H H H H H H H H H H H H H H H H H H H
charge: 0
multiplicity: 1
keywords: wb97x-d3
keywords: def2-TZVPP
keywords: def2/J RIJCOSX GRIDX6 NOFINALGRIDX
keywords: grid4 nofinalgrid
keywords: scfconv7
keywords: smallprint printgap noloewdin
keywords: NOSOSCF
formula: C17H21N5O9S2
InChI: InChI=1S/C17H21N5O9S2/c1-29-13-8-14(30-2)20-16(19-13)21-17(24)22-33(27,28)12-7-10(9-18-32(4,25)26)5-6-11(12)15(23)31-3/h5-8,18,21-22H,9H2,1-4H3
54 atoms
S  -0.538066 1.838634 1.353038
S  5.053029 -0.086571 -0.766531
O  -1.746285 2.551364 0.995483
O  0.132188 2.087983 2.603213
O  -1.585282 3.101503 -2.414633
O  6.156643 -0.886634 -0.275608
O  5.055858 0.458416 -2.112478
O  -1.791919 1.043669 -1.563158
O  1.079011 -0.656094 1.685674
O  -3.487007 -5.550482 0.652579
O  -5.048597 -1.193154 0.300546
N  4.866245 1.166644 0.326004
N  -0.976362 0.231532 1.267365
N  -0.641369 -2.065962 1.326397
N  -2.061558 -3.803277 0.993451
N  -2.858138 -1.58834 0.811684
C  0.6522 2.049988 0.045075
C  2.953796 2.399554 -0.558724
C  4.404324 2.455947 -0.162302
C  1.984146 2.138904 0.403904
C  0.249999 2.234512 -1.278877
C  2.561019 2.579875 -1.874725
C  1.220963 2.515707 -2.228075
C  -1.160109 2.049563 -1.735324
C  3.553124 -1.018575 -0.559938
C  -0.096001 -0.798014 1.447825
C  -1.916707 -2.490027 1.030383
C  -2.913905 3.043888 -2.921392
C  -3.275941 -4.247328 0.706666
C  -4.071543 -2.049318 0.524728
C  -4.352365 -3.404772 0.455862
C  -2.399168 -6.423616 0.910536
C  -4.764736 0.200043 0.339622
H  4.524802 3.156744 0.665671
H  5.006175 2.833424 -0.993367
H  2.273108 1.996536 1.436314
H  3.306513 2.763331 -2.637065
H  0.935886 2.6657 -3.260551
H  5.65319 1.200132 0.960078
H  -1.925959 0.006597 0.952592
H  3.455372 -1.325944 0.476722
H  3.624702 -1.888596 -1.210954
H  2.697595 -0.412416 -0.844063
H  -3.070419 3.978375 -3.452196
H  -3.638234 2.96126 -2.111072
H  -3.049129 2.206257 -3.605629
H  -5.337297 -3.77866 0.222892
H  -2.800745 -7.428641 0.812832
H  -2.000452 -6.287636 1.91619
H  -1.589128 -6.284802 0.194041
H  -4.408906 0.516075 1.321214
H  -4.030747 0.484244 -0.414108
H  -5.709445 0.694416 0.13022
H  0.02302 -2.810473 1.473933
totalener: -2407.83894354 hartree
nucrepener: 4134.19487496 hartree
electener: -6542.03381849 hartree
twoeener: 4988.92722288 hartree
kineticenergy: 2399.69269987 hartree
xcener: -185.885449997439 hartree
chargesum: -0.0000000
charge: 0.875023 0.806989 -0.472610 -0.432814 -0.253266 -0.474039 -0.467560 -0.380362 -0.406916 -0.263845 -0.264636 -0.232346 -0.203061 -0.166172 -0.409972 -0.421332 -0.185673 -0.141750 -0.059116 0.029187 0.083739 -0.023222 -0.161629 0.390583 -0.246919 0.354159 0.362738 -0.136893 0.385944 0.404084 -0.302738 -0.125277 -0.129302 0.120154 0.121235 0.126848 0.124305 0.124020 0.141107 0.215126 0.128850 0.132820 0.106231 0.125286 0.112496 0.113335 0.128934 0.123950 0.108407 0.107500 0.110355 0.107220 0.125629 0.165195
qa: 0.8750 0.8070 -0.4726 -0.4328 -0.2533 -0.4740 -0.4676 -0.3804 -0.4069 -0.2638 -0.2646 -0.2323 -0.2031 -0.1662 -0.4100 -0.4213 -0.1857 -0.1418 -0.0591 0.0292 0.0837 -0.0232 -0.1616 0.3906 -0.2469 0.3542 0.3627 -0.1369 0.3859 0.4041 -0.3027 -0.1253 -0.1293 0.1202 0.1212 0.1268 0.1243 0.1240 0.1411 0.2151 0.1288 0.1328 0.1062 0.1253 0.1125 0.1133 0.1289 0.1240 0.1084 0.1075 0.1104 0.1072 0.1256 0.1652
va: 5.8333 5.8177 2.0204 2.0799 2.1425 2.0187 1.9910 2.1150 2.1061 2.1496 2.1618 2.9612 3.1160 3.1630 2.9711 2.9736 3.9081 3.6976 3.9367 3.7611 3.6908 3.9114 4.0837 4.1508 3.8842 4.3938 4.2434 3.8900 4.0565 4.0174 3.9375 3.8768 3.8680 0.9924 1.0061 1.0523 1.0176 1.0178 1.0456 1.0468 1.0275 1.0115 1.0103 0.9958 0.9926 0.9935 1.0221 0.9941 0.9968 0.9970 0.9973 1.0041 0.9956 1.0382
dispcorr: -0.034011884 hartree
energy: -2407.872955420087
dipole: -6.11643 4.56789 -1.54854 -4.39868 4.13951 -0.25917 -7.83576 6.90775 -0.92801
magnitude: 1.82383 au
magnitude: 4.63581 debye
