program: Orca
programVersion: 4.2.1
elementType: S F F F O O O O O N N N N N C C C C C C C C C C C C C H H H H H H H H H H H H
charge: 0
multiplicity: 1
keywords: wb97x-d3
keywords: def2-TZVPP
keywords: def2/J RIJCOSX GRIDX6 NOFINALGRIDX
keywords: grid4 nofinalgrid
keywords: scfconv7
keywords: smallprint printgap noloewdin
keywords: NOSOSCF
formula: C13H12F3N5O5S
InChI: InChI=1S/C13H12F3N5O5S/c1-25-8-6-9(26-2)19-11(18-8)20-12(22)21-27(23,24)10-7(13(14,15)16)4-3-5-17-10/h3-6,20-21H,1-2H3
39 atoms
S  -1.217017 -1.364418 -0.980458
F  -2.541802 -2.791722 2.05075
F  -4.542025 -2.019656 2.008444
F  -3.589885 -2.601555 0.177441
O  -2.148282 -1.490263 -2.078474
O  -0.727122 -2.537618 -0.284227
O  -0.772647 0.9036 -2.975609
O  3.498227 -0.781582 1.304788
O  4.929933 3.348045 -0.256998
N  0.14303 -0.576837 -1.482779
N  -1.435023 0.986189 0.144208
N  1.229834 1.390653 -2.070125
N  2.360559 0.2709 -0.376028
N  3.076082 2.372068 -1.172608
C  -1.910133 -0.231812 0.251815
C  -2.842706 -0.62066 1.210149
C  -3.26442 0.359686 2.099678
C  -3.378409 -2.016496 1.358275
C  -2.766161 1.64524 1.991384
C  0.117707 0.59712 -2.216618
C  -1.853373 1.917778 0.990525
C  2.264884 1.331919 -1.15848
C  3.367272 0.252754 0.492478
C  4.079085 2.337797 -0.305386
C  4.286614 1.282887 0.57576
C  2.542293 -1.838172 1.238453
C  4.727489 4.469338 -1.115064
H  0.958303 -0.663898 -0.848788
H  -3.978417 0.132438 2.878502
H  -3.082216 2.42047 2.673213
H  -1.4395 2.908883 0.863115
H  1.218288 2.222871 -2.645162
H  5.105873 1.269499 1.27926
H  1.539792 -1.488268 1.486053
H  2.539594 -2.319255 0.260384
H  2.852861 -2.562664 1.985783
H  4.804964 4.192227 -2.165745
H  5.52127 5.169679 -0.871032
H  3.763638 4.944351 -0.936229
elementType: S F O N C H
totalener: -1850.43599302 hartree
nucrepener: 2914.57586244 hartree
electener: -4765.01185546 hartree
oneelecener: -8340.51773679 hartree
twoeener: 3575.50588133 hartree
cpcmener: -0.05300765 hartree
kineticenergy: 1844.14945497 hartree
xcener: -147.911372376320 hartree
chargesum: -0.0000000
charge: 0.871878 -0.164830 -0.170628 -0.169193 -0.485005 -0.498866 -0.459456 -0.297330 -0.299404 -0.211261 -0.312152 -0.136908 -0.420709 -0.421767 0.136600 -0.105065 -0.061838 0.538381 -0.133555 0.346415 0.049999 0.366710 0.428770 0.421960 -0.323923 -0.122835 -0.113847 0.197838 0.156221 0.172633 0.154510 0.192689 0.147534 0.104632 0.120531 0.139384 0.115006 0.132516 0.114362
qa: 0.8719 -0.1648 -0.1706 -0.1692 -0.4850 -0.4989 -0.4595 -0.2973 -0.2994 -0.2113 -0.3122 -0.1369 -0.4207 -0.4218 0.1366 -0.1051 -0.0618 0.5384 -0.1336 0.3464 0.0500 0.3667 0.4288 0.4220 -0.3239 -0.1228 -0.1138 0.1978 0.1562 0.1726 0.1545 0.1927 0.1475 0.1046 0.1205 0.1394 0.1150 0.1325 0.1144
va: 5.7974 1.1308 1.1373 1.1343 1.9858 1.9753 2.0472 2.1333 2.1224 3.0706 3.0106 3.1817 2.9891 2.9689 3.9036 3.7883 3.9505 4.4390 3.9277 4.4534 4.0030 4.2513 3.9717 4.0152 3.9317 3.8435 3.8445 1.0987 1.0027 0.9861 0.9919 1.0158 1.0156 0.9964 0.9892 0.9966 0.9950 0.9934 0.9959
dispcorr: -0.021140730 hartree
energy: -1850.457133749347
dipole: 28.72220 -26.92313 1.79907 22.16730 -18.66486 3.50244 0.14713 3.07311 3.22023
magnitude: 5.08662 au
magnitude: 12.92915 debye
