program: Orca
programVersion: 4.2.1
elementType: S F F F O O O O O N N N N N C C C C C C C C C C C C C H H H H H H H H H H H H
charge: 0
multiplicity: 1
keywords: wb97x-d3
keywords: def2-TZVPP
keywords: def2/J RIJCOSX GRIDX6 NOFINALGRIDX
keywords: grid4 nofinalgrid
keywords: scfconv7
keywords: smallprint printgap noloewdin
keywords: NOSOSCF
formula: C13H12F3N5O5S
InChI: InChI=1S/C13H12F3N5O5S/c1-25-8-6-9(26-2)19-11(18-8)20-12(22)21-27(23,24)10-7(13(14,15)16)4-3-5-17-10/h3-6,20-21H,1-2H3
39 atoms
S  -1.464275 1.232473 -0.697292
F  -4.136603 1.591645 0.406104
F  -5.067144 0.34074 1.877506
F  -3.312357 1.462156 2.392347
O  -1.306069 2.245969 0.326633
O  -2.325592 1.458986 -1.834885
O  -0.388996 -0.270032 -3.122057
O  5.73467 -1.809994 -0.651267
O  3.180365 1.157842 1.840456
N  0.069973 0.910725 -1.210346
N  -1.193268 -1.325402 -0.220991
N  1.642944 -0.494124 -2.17916
N  3.686545 -1.152364 -1.426305
N  2.398362 0.358585 -0.153447
C  -1.955425 -0.311309 0.113656
C  -3.028395 -0.402759 0.996912
C  -3.276601 -1.655104 1.544653
C  -3.887318 0.756649 1.416429
C  -2.479217 -2.728715 1.192606
C  0.368774 0.020069 -2.225136
C  -1.445293 -2.518829 0.300318
C  2.613086 -0.418998 -1.200827
C  4.631175 -1.098896 -0.497077
C  3.352385 0.399322 0.771967
C  4.524071 -0.326054 0.653504
C  5.878913 -2.628792 -1.809831
C  1.966522 1.894357 1.976257
H  0.81032 1.004076 -0.491246
H  -4.085787 -1.803585 2.245352
H  -2.658634 -3.710367 1.604996
H  -0.795706 -3.327506 -0.006036
H  1.869084 -1.100411 -2.956771
H  5.301367 -0.294276 1.402502
H  5.894868 -2.034819 -2.722972
H  6.835014 -3.131136 -1.693989
H  5.088747 -3.37519 -1.877786
H  1.101298 1.233636 2.035615
H  1.835806 2.610026 1.164628
H  2.055509 2.437137 2.912912
elementType: S F O N C H
totalener: -1850.43633955 hartree
nucrepener: 2906.37630888 hartree
electener: -4756.81264843 hartree
oneelecener: -8324.18884908 hartree
twoeener: 3567.37620064 hartree
cpcmener: -0.05275944 hartree
kineticenergy: 1844.15146932 hartree
xcener: -147.912060005066 hartree
chargesum: 0.0000000
charge: 0.871275 -0.168628 -0.170977 -0.164889 -0.499397 -0.485537 -0.461195 -0.299643 -0.297162 -0.207346 -0.311889 -0.134475 -0.423020 -0.421684 0.143183 -0.109818 -0.061791 0.537293 -0.135526 0.346883 0.048764 0.369395 0.422866 0.428143 -0.323841 -0.113878 -0.121852 0.195994 0.156561 0.173419 0.155076 0.191882 0.147066 0.115119 0.132523 0.113662 0.106179 0.117866 0.139398
qa: 0.8713 -0.1686 -0.1710 -0.1649 -0.4994 -0.4855 -0.4612 -0.2996 -0.2972 -0.2073 -0.3119 -0.1345 -0.4230 -0.4217 0.1432 -0.1098 -0.0618 0.5373 -0.1355 0.3469 0.0488 0.3694 0.4229 0.4281 -0.3238 -0.1139 -0.1219 0.1960 0.1566 0.1734 0.1551 0.1919 0.1471 0.1151 0.1325 0.1137 0.1062 0.1179 0.1394
va: 5.7967 1.1348 1.1370 1.1307 1.9761 1.9862 2.0455 2.1225 2.1337 3.0721 3.0093 3.1823 2.9712 2.9903 3.9002 3.7944 3.9506 4.4403 3.9267 4.4483 4.0044 4.2510 4.0136 3.9723 3.9283 3.8452 3.8442 1.1008 1.0025 0.9857 0.9916 1.0164 1.0158 0.9949 0.9934 0.9957 0.9954 0.9899 0.9963
dispcorr: -0.020947188 hartree
energy: -1850.457286742458
dipole: 33.63014 -31.23358 2.39656 -14.03098 10.34487 -3.68611 -2.43765 4.77747 2.33982
magnitude: 4.98053 au
magnitude: 12.65950 debye
