program: Gaussian 09
title: 000073937
version: EM64L-G09RevD.01
frameworkgroup: C1[X(C8H14)]
method: RPBEPBE
basis: SDD
operation: Freq
keyword: #p
keyword: freq=noraman
keyword: PBEPBE/SDD
title: #p freq=noraman PBEPBE/SDD
converged: YES YES NO NO
title: Mulliken charges:
elementType: C C C C C C C C H H H H H H H H H H H H H H
charge: -0.408124 -0.518499 -0.408430 0.466283 -0.420549 -0.404812 -0.536639 -0.677895 0.201148 0.200934 0.210365 0.210201 0.200640 0.203545 0.207866 0.205583 0.208341 0.213066 0.198165 0.215541 0.223971 0.209300
chargesum: 0.00000
title: Mulliken charges with hydrogens summed into heavy atoms:
elementType: C C C C C C C C
charge: -0.006043 -0.097933 -0.004245 0.466283 -0.007101 -0.196472 -0.125407 -0.029083
polarizability: 9.81631025e+01 6.39745964e+00 8.50240338e+01 2.93223577e+00 2.52510369e+00 6.60437078e+01
1716.lowfreq: -19.2984 -7.4551 -0.0005 0.0005 0.0007 18.8971 62.5279 101.8143 191.9434
frequency: 62.4659 101.7785 191.9387 213.5905 253.0117 326.6152 338.8983 421.0946 472.7601 520.0342 603.3303 751.5153 779.1050 804.4801 836.5781 851.6074 911.2280 918.7896 937.5038 981.1301 1043.7099 1052.5753 1073.1354 1080.6579 1111.6227 1133.2203 1164.1083 1175.6953 1235.6887 1246.7448 1261.5075 1308.9851 1318.3421 1333.0875 1336.3178 1344.7467 1371.1191 1383.9988 1451.4093 1459.6426 1465.6853 1467.4625 1473.4784 1475.3082 1485.9793 1687.4726 2944.9877 2946.0769 2960.0905 2974.5199 2975.7405 2979.5587 3002.1144 3004.4465 3024.4943 3034.0751 3044.2681 3073.7941 3081.9011 3083.9083
redmass: 2.2043 2.2349 1.3720 1.7222 2.0736 1.8683 2.0247 2.5996 3.1809 2.6771 2.1499 2.2784 1.2864 1.2778 1.5039 2.3770 2.1777 1.3846 2.2585 2.5641 1.4912 2.0016 1.8905 1.8473 1.2921 1.2077 2.1342 1.6394 1.3042 1.2114 1.1732 1.3433 1.3679 1.4438 1.7050 1.5332 1.7758 1.2066 1.0894 1.0812 1.0771 1.0825 1.0892 1.0515 1.0667 6.8192 1.0644 1.0644 1.0623 1.0621 1.0663 1.0354 1.0911 1.0918 1.0978 1.0991 1.1041 1.0993 1.0973 1.0938
irintensity: 0.0971 0.1320 1.3984 0.7343 0.2490 1.1741 0.8874 2.1605 1.4981 4.1812 3.0794 1.8426 2.8195 8.8755 9.6879 6.4591 8.7576 5.8483 3.3632 4.4709 0.8562 7.4297 0.7532 1.4556 2.0026 3.9652 0.9667 2.3209 1.1164 0.2168 1.9013 4.0401 0.3080 1.4309 0.8742 0.9670 1.6729 12.6518 0.9564 8.6681 10.8692 4.6854 7.9601 17.3385 10.3513 2.2387 25.8430 50.6463 53.5289 21.6017 34.6454 33.8165 92.8150 7.9652 16.2381 66.3588 77.9043 50.4835 19.0809 71.5081
temp: 298.150 k
press: 1.00000 atm
elementType: 6 6 6 6 6 6 6 6 1 1 1 1 1 1 1 1 1 1 1 1 1 1
symmnumber: 1
zpe: 522463.8 jmol-1
zpe.correction: 0.198996 hartree
zpe.thermalcorrener: 0.207554 hartree
zpe.thermalcorrenthalpy: 0.208498 hartree
zpe.thermalcorrgfe: 0.165861 hartree
zpe.sumelectzpe: -312.591929 hartree
zpe.sumelectthermal: -312.583371 hartree
zpe.sumelectthermalent: -312.582427 hartree
zpe.sumelectthermalfe: -312.625064 hartree
dipole: 0.0494 -0.2522 -0.0071
dipole: 0.2571
quadrupole: -49.6252 -49.7873 -51.7243
quadrupole: 0.1087 0.6672 0.5834
quadrupole: 0.7537 0.5917 -1.3454 0.1087 0.6672 0.5834
hfenergy: -312.7909247 hartree
pointgroup: C01 [X(C8H14)]
dipole: -0.023367 -0.0981485 -0.0073177 debye
dipolederiv: 0.0603198 0.0520042 -0.0214844 0.0313769 0.0668861 -0.0369994 0.0117855 -0.0101751 0.1312464 -0.0511141 -0.0154673 -0.0386627 -0.0551864 0.0022772 -0.0163773 -0.0604906 0.0295314 0.1783329 0.0753479 0.019113 0.0315626 0.0385605 0.0200136 -0.0048004 0.0017614 -0.0230838 0.1435301 0.1495526 0.0182551 0.0154386 0.0406401 0.1984603 -0.0170357 0.0480944 -0.0433885 -0.1782645 -0.0051479 -0.0457558 -0.0263741 0.0141709 0.0235974 0.0074714 -0.076261 0.0283007 0.2136292 0.0772787 0.0053797 0.0876592 0.0463154 -0.0230701 0.0106291 0.1027727 -0.0158992 -0.2542834 0.0225949 -0.0247215 0.0180941 0.0123096 0.0951342 -0.0247634 0.0601684 -0.0540335 0.1427844 -0.0314622 0.0378194 0.0476597 0.0080848 0.079332 -0.0265985 -0.0074649 -0.0110295 0.0043568 0.0330404 0.0187881 0.032685 0.0284439 0.0681104 0.0599487 0.0026182 -0.0044349 -0.1844223 -0.0258774 -0.1163332 -0.0053681 -0.125779 -0.1824375 -0.0033065 0.0104285 0.0243116 0.0766227 -0.0446976 0.108869 0.0660761 0.1185004 -0.0433231 -0.057833 0.0733527 -0.1099374 0.0251013 0.0530135 -0.0561339 -0.0007464 -0.0023045 -0.0199099 0.0671156 -0.0208285 0.1175103 -0.1349077 0.083539 0.0031865 0.0005173 -0.0146198 0.0172286 0.0329757 0.0737588 0.030782 -0.1834185 -0.2282603 -0.0049567 -0.0717454 -0.0048494 0.0512382 -0.0011275 -0.107701 -0.0057257 0.0499343 -0.0388973 0.0948089 0.0376064 0.0703471 -0.0902008 -0.0957216 0.0898195 -0.1306763 0.0166214 -0.0278173 0.0365847 -0.0399486 -0.0232194 0.0566416 0.0543305 -0.0870326 0.1230502 -0.1494243 -0.0435622 -0.1241684 -0.0267759 -0.114782 -0.106354 -0.0130336 -0.0312381 -0.0193703 0.1396676 0.0022146 -0.0254746 -0.0062927 -0.0996413 -0.1458007 -0.1071478 -0.0003056 -0.0562847 0.038809 -0.0024193 0.0405016 -0.015166 0.0604621 -0.010043 0.1427885 -0.0536726 0.1134059 -0.1018232 -0.2513388 0.019646 -0.0252624 0.0017228 0.0923375 -0.0089126 -0.0365507 -0.0153108 0.0654154 0.0903848 0.0415692 -0.0374888 0.007701 -0.0069728 0.1284204 0.011815 0.0927528 -0.0811112 0.1033083 -0.0835137 -0.0219836 -0.0382536 -0.1431452 -0.0900226 -0.0048296 -0.0602951 0.0416035 unknown
polarizability: 97.667988|-7.1531074|85.8802775|1.8879137|-0.5168369|65.6825785 unknown
InChI: InChI=1S/C8H14/c1-2-8-6-4-3-5-7-8/h6H,2-5,7H2,1H3
charge 0 multiplicity 1
22 atoms
C  -1.465979 -1.214748 -0.464377
C  -0.063361 -1.245236 0.186949
C  -2.319386 -0.071639 0.130289
C  0.578591 0.136825 0.278117
C  -1.65512 1.299543 -0.139687
C  -0.157939 1.273188 0.123287
C  2.075823 0.18317 0.555284
C  2.944011 -0.24174 -0.660424
H  -1.360478 -1.056055 -1.556562
H  -1.970658 -2.190267 -0.325389
H  0.599795 -1.930268 -0.37869
H  -0.13424 -1.674434 1.210172
H  -2.414753 -0.22411 1.224148
H  -3.343065 -0.089064 -0.290426
H  -2.128938 2.081814 0.487171
H  -1.839999 1.606211 -1.192249
H  0.349643 2.247601 0.191009
H  2.365677 1.206584 0.862002
H  2.313772 -0.485062 1.409753
H  4.019528 -0.214717 -0.404695
H  2.774735 0.437709 -1.515105
H  2.704342 -1.268604 -0.992077
