program: Orca
programVersion: 4.2.1
elementType: S F F F O O O O O N N N N N C C C C C C C C C C C C C H H H H H H H H H H H H
charge: 0
multiplicity: 1
keywords: wb97x-d3
keywords: def2-TZVPP
keywords: def2/J RIJCOSX GRIDX6 NOFINALGRIDX
keywords: grid4 nofinalgrid
keywords: scfconv7
keywords: smallprint printgap noloewdin
keywords: NOSOSCF
formula: C13H12F3N5O5S
InChI: InChI=1S/C13H12F3N5O5S/c1-25-8-6-9(26-2)19-11(18-8)20-12(22)21-27(23,24)10-7(13(14,15)16)4-3-5-17-10/h3-6,20-21H,1-2H3
39 atoms
S  -1.339993 0.960981 -0.40823
F  -3.650813 1.520013 2.269699
F  -3.999943 1.988111 0.196611
F  -5.498275 0.962502 1.334585
O  -1.134878 1.82028 0.741521
O  -1.882691 1.491203 -1.638612
O  -0.279673 -0.655741 -2.730561
O  6.287492 -1.052824 -1.093851
O  3.501701 0.936688 2.038877
N  0.138746 0.292271 -0.69291
N  -1.844072 -1.601837 -0.185364
N  1.811631 -0.756394 -1.904106
N  4.042239 -0.914207 -1.501367
N  2.63092 0.098342 0.096703
C  -2.363961 -0.435822 0.111922
C  -3.592857 -0.268685 0.749667
C  -4.283858 -1.427775 1.07808
C  -4.183263 1.058816 1.13618
C  -3.74353 -2.661273 0.763669
C  0.488878 -0.387219 -1.835372
C  -2.516808 -2.701495 0.129707
C  2.869235 -0.505196 -1.055259
C  5.078794 -0.68003 -0.708868
C  3.681481 0.327924 0.87955
C  4.964676 -0.047473 0.523354
C  6.4481 -1.685802 -2.361726
C  2.18837 1.354472 2.405808
H  0.875705 0.420676 0.018892
H  -5.240504 -1.380363 1.578232
H  -4.266454 -3.573471 1.009405
H  -2.054083 -3.643425 -0.132532
H  2.057272 -1.238982 -2.758461
H  5.818289 0.142061 1.157183
H  6.118747 -1.043883 -3.177862
H  7.513669 -1.871532 -2.462283
H  5.913447 -2.633763 -2.409128
H  1.505478 0.509175 2.491105
H  1.789871 2.08781 1.704666
H  2.291084 1.821837 3.380916
elementType: S F O N C H
totalener: -1850.43640759 hartree
nucrepener: 2855.60375509 hartree
electener: -4706.04016268 hartree
oneelecener: -8223.19633077 hartree
twoeener: 3517.15616809 hartree
cpcmener: -0.05081557 hartree
kineticenergy: 1844.14696350 hartree
xcener: -147.911711512494 hartree
chargesum: 0.0000000
charge: 0.861899 -0.165243 -0.168346 -0.171264 -0.503914 -0.485202 -0.472349 -0.300320 -0.297742 -0.194966 -0.316233 -0.140122 -0.426936 -0.430257 0.155136 -0.126917 -0.057172 0.536900 -0.139901 0.370355 0.053125 0.376374 0.419617 0.426041 -0.323302 -0.115522 -0.128722 0.210245 0.156168 0.173047 0.155451 0.191228 0.147602 0.113959 0.133182 0.115472 0.116407 0.112750 0.139473
qa: 0.8619 -0.1652 -0.1683 -0.1713 -0.5039 -0.4852 -0.4723 -0.3003 -0.2977 -0.1950 -0.3162 -0.1401 -0.4269 -0.4303 0.1551 -0.1269 -0.0572 0.5369 -0.1399 0.3704 0.0531 0.3764 0.4196 0.4260 -0.3233 -0.1155 -0.1287 0.2102 0.1562 0.1730 0.1555 0.1912 0.1476 0.1140 0.1332 0.1155 0.1164 0.1127 0.1395
va: 5.7776 1.1303 1.1352 1.1364 1.9748 1.9871 2.0374 2.1211 2.1314 3.0943 3.0254 3.1796 2.9675 2.9837 3.9207 3.8100 3.9465 4.4356 3.9222 4.4283 4.0014 4.2455 4.0179 3.9783 3.9305 3.8449 3.8416 1.0778 1.0032 0.9859 0.9910 1.0177 1.0157 0.9957 0.9930 0.9950 0.9898 0.9955 0.9967
dispcorr: -0.019763918 hartree
energy: -1850.456171509632
dipole: 33.52773 -32.16674 1.36098 -14.09197 10.78062 -3.31135 -2.77265 4.48094 1.70829
magnitude: 3.96681 au
magnitude: 10.08282 debye
