program: Orca
programVersion: 4.2.1
elementType: S F F F O O O O O N N N N N C C C C C C C C C C C C C H H H H H H H H H H H H
charge: 0
multiplicity: 1
keywords: wb97x-d3
keywords: def2-TZVPP
keywords: def2/J RIJCOSX GRIDX6 NOFINALGRIDX
keywords: grid4 nofinalgrid
keywords: scfconv7
keywords: smallprint printgap noloewdin
keywords: NOSOSCF
formula: C13H12F3N5O5S
InChI: InChI=1S/C13H12F3N5O5S/c1-25-8-6-9(26-2)19-11(18-8)20-12(22)21-27(23,24)10-7(13(14,15)16)4-3-5-17-10/h3-6,20-21H,1-2H3
39 atoms
S  -1.832832 1.202924 1.179233
F  -1.740302 -0.598101 -3.07371
F  -1.036531 0.94417 -1.768812
F  -0.49089 -1.110584 -1.409436
O  -2.233129 1.212734 2.566651
O  -1.749259 2.457329 0.458448
O  -0.932625 -1.454239 1.986361
O  5.551972 -1.474234 -0.041887
O  3.156588 2.43751 -0.748695
N  -0.336172 0.511825 1.027816
N  -4.033515 -0.126363 1.01022
N  1.20752 -1.19832 1.311411
N  3.371622 -1.34391 0.632483
N  2.159887 0.64761 0.267443
C  -2.941225 0.063083 0.309978
C  -2.716092 -0.50218 -0.94634
C  -3.705695 -1.353512 -1.424601
C  -1.490893 -0.308107 -1.797858
C  -4.849322 -1.572855 -0.68017
C  -0.07778 -0.756119 1.480698
C  -4.979454 -0.921789 0.530907
C  2.289103 -0.593544 0.703481
C  4.431454 -0.781854 0.06731
C  3.23138 1.197761 -0.296628
C  4.428893 0.517408 -0.426221
C  5.58759 -2.817487 0.436264
C  1.920365 3.140174 -0.642391
H  0.439141 1.037464 0.594211
H  -3.595608 -1.849913 -2.377824
H  -5.625544 -2.232149 -1.038815
H  -5.863939 -1.044928 1.141059
H  1.367189 -2.144782 1.631217
H  5.299341 0.964021 -0.883532
H  4.869895 -3.449514 -0.085405
H  6.592857 -3.173776 0.230125
H  5.402531 -2.868928 1.50853
H  1.13525 2.659435 -1.226099
H  2.106683 4.127344 -1.055198
H  1.603356 3.247487 0.395049
elementType: S F O N C H
totalener: -1850.43674803 hartree
nucrepener: 2971.05633319 hartree
electener: -4821.49308122 hartree
oneelecener: -8453.68153337 hartree
twoeener: 3632.18845215 hartree
cpcmener: -0.05060223 hartree
kineticenergy: 1844.15067573 hartree
xcener: -147.911655957399 hartree
chargesum: -0.0000000
charge: 0.876545 -0.167064 -0.170494 -0.169131 -0.492713 -0.503412 -0.469246 -0.299545 -0.296688 -0.227203 -0.300294 -0.126871 -0.423805 -0.425753 0.091927 -0.107814 -0.063408 0.564161 -0.136836 0.349713 0.063447 0.369234 0.420578 0.423534 -0.321563 -0.115415 -0.124318 0.225047 0.154049 0.171884 0.160555 0.195226 0.147526 0.115200 0.132995 0.114715 0.109075 0.140977 0.115187
qa: 0.8765 -0.1671 -0.1705 -0.1691 -0.4927 -0.5034 -0.4692 -0.2995 -0.2967 -0.2272 -0.3003 -0.1269 -0.4238 -0.4258 0.0919 -0.1078 -0.0634 0.5642 -0.1368 0.3497 0.0634 0.3692 0.4206 0.4235 -0.3216 -0.1154 -0.1243 0.2250 0.1540 0.1719 0.1606 0.1952 0.1475 0.1152 0.1330 0.1147 0.1091 0.1410 0.1152
va: 5.7938 1.1451 1.1370 1.1170 2.0120 1.9709 2.0401 2.1230 2.1328 3.0594 3.0550 3.1896 2.9723 2.9683 3.9581 3.7685 3.9576 4.3796 3.9220 4.4326 3.9859 4.2396 4.0163 3.9881 3.9336 3.8451 3.8442 1.0558 1.0047 0.9864 0.9908 1.0146 1.0155 0.9951 0.9933 0.9951 0.9971 0.9955 0.9908
dispcorr: -0.022011705 hartree
energy: -1850.458759737788
dipole: 16.02302 -15.06868 0.95434 -3.57000 1.36789 -2.20211 4.48422 -6.93352 -2.44930
magnitude: 3.42916 au
magnitude: 8.71622 debye
