program: Orca
programVersion: 4.2.1
elementType: S F F F O O O O O N N N N N C C C C C C C C C C C C C H H H H H H H H H H H H
charge: 0
multiplicity: 1
keywords: wb97x-d3
keywords: def2-TZVPP
keywords: def2/J RIJCOSX GRIDX6 NOFINALGRIDX
keywords: grid4 nofinalgrid
keywords: scfconv7
keywords: smallprint printgap noloewdin
keywords: NOSOSCF
formula: C13H12F3N5O5S
InChI: InChI=1S/C13H12F3N5O5S/c1-25-8-6-9(26-2)19-11(18-8)20-12(22)21-27(23,24)10-7(13(14,15)16)4-3-5-17-10/h3-6,20-21H,1-2H3
39 atoms
S  -1.806239 1.379527 0.986116
F  -1.091967 0.696833 -1.906248
F  -0.546582 -1.296331 -1.292824
F  -1.850713 -0.998188 -2.968016
O  -2.170295 1.596794 2.366436
O  -1.726828 2.514924 0.08989
O  -0.921032 -1.143519 2.156968
O  5.563645 -1.48584 0.153496
O  3.185267 2.296119 -1.104944
N  -0.32341 0.647023 0.900147
N  -4.013722 0.052373 1.074196
N  1.207788 -1.020406 1.413806
N  3.376287 -1.26298 0.778911
N  2.172329 0.659861 0.129631
C  -2.943423 0.135721 0.321449
C  -2.751837 -0.610012 -0.842548
C  -3.749163 -1.526532 -1.157173
C  -1.554628 -0.542809 -1.751644
C  -4.867722 -1.635495 -0.352794
C  -0.069054 -0.540663 1.5357
C  -4.967539 -0.808636 0.749077
C  2.295379 -0.508237 0.735895
C  4.444022 -0.783524 0.15552
C  3.252352 1.128627 -0.489191
C  4.451036 0.438103 -0.507243
C  5.588919 -2.753668 0.806136
C  1.949234 3.007466 -1.106536
H  0.45418 1.09825 0.392768
H  -3.66258 -2.160623 -2.027685
H  -5.648405 -2.344803 -0.583458
H  -5.83266 -0.840682 1.397316
H  1.363714 -1.910619 1.868431
H  5.329042 0.819808 -1.006928
H  6.59749 -3.132763 0.668159
H  5.383236 -2.66326 1.872025
H  4.880584 -3.450291 0.359196
H  1.168015 2.450859 -1.624709
H  2.1404 3.928296 -1.64969
H  1.624373 3.256204 -0.096117
elementType: S F O N C H
totalener: -1850.43687737 hartree
nucrepener: 2968.06126768 hartree
electener: -4818.49814505 hartree
oneelecener: -8447.72125304 hartree
twoeener: 3629.22310799 hartree
cpcmener: -0.05090496 hartree
kineticenergy: 1844.15327961 hartree
xcener: -147.912273419611 hartree
chargesum: 0.0000000
charge: 0.876221 -0.170344 -0.169040 -0.167389 -0.492249 -0.501872 -0.474039 -0.299428 -0.296921 -0.229666 -0.299987 -0.126068 -0.424865 -0.425751 0.089083 -0.106086 -0.064233 0.563588 -0.136762 0.354061 0.064769 0.370507 0.420375 0.424370 -0.321849 -0.114886 -0.124393 0.226163 0.153695 0.171638 0.160446 0.194982 0.148049 0.133340 0.114147 0.114989 0.108494 0.140788 0.116124
qa: 0.8762 -0.1703 -0.1690 -0.1674 -0.4922 -0.5019 -0.4740 -0.2994 -0.2969 -0.2297 -0.3000 -0.1261 -0.4249 -0.4258 0.0891 -0.1061 -0.0642 0.5636 -0.1368 0.3541 0.0648 0.3705 0.4204 0.4244 -0.3218 -0.1149 -0.1244 0.2262 0.1537 0.1716 0.1604 0.1950 0.1480 0.1333 0.1141 0.1150 0.1085 0.1408 0.1161
va: 5.7947 1.1371 1.1173 1.1443 2.0128 1.9722 2.0340 2.1229 2.1330 3.0589 3.0532 3.1918 2.9722 2.9687 3.9602 3.7665 3.9604 4.3830 3.9221 4.4242 3.9855 4.2395 4.0159 3.9876 3.9315 3.8450 3.8442 1.0540 1.0048 0.9865 0.9908 1.0148 1.0154 0.9932 0.9955 0.9953 0.9968 0.9958 0.9905
dispcorr: -0.021937212 hartree
energy: -1850.458814581648
dipole: 16.31305 -15.39636 0.91669 -3.07567 0.52398 -2.55169 5.15082 -7.22090 -2.07007
magnitude: 3.41125 au
magnitude: 8.67071 debye
