program: Orca
programVersion: 4.2.1
elementType: S F F F O O O O O N N N N N C C C C C C C C C C C C C H H H H H H H H H H H H
charge: 0
multiplicity: 1
keywords: wb97x-d3
keywords: def2-TZVPP
keywords: def2/J RIJCOSX GRIDX6 NOFINALGRIDX
keywords: grid4 nofinalgrid
keywords: scfconv7
keywords: smallprint printgap noloewdin
keywords: NOSOSCF
formula: C13H12F3N5O5S
InChI: InChI=1S/C13H12F3N5O5S/c1-25-8-6-9(26-2)19-11(18-8)20-12(22)21-27(23,24)10-7(13(14,15)16)4-3-5-17-10/h3-6,20-21H,1-2H3
39 atoms
S  -1.181555 0.858944 0.985249
F  -5.581668 -0.389808 1.308362
F  -3.850683 -0.943492 2.43695
F  -4.124461 1.103359 1.792961
O  -1.482939 0.526133 2.358467
O  -1.183498 2.245112 0.559772
O  -0.164957 -1.861538 1.103772
O  6.090368 -1.196989 -1.463928
O  3.513277 2.657602 -1.210463
N  0.323419 0.296311 0.604759
N  -1.659477 -0.258279 -1.301469
N  1.875962 -1.393883 0.257357
N  3.976995 -1.300077 -0.602818
N  2.671456 0.661227 -0.481239
C  -2.249194 -0.06614 -0.144373
C  -3.549953 -0.467312 0.145493
C  -4.220439 -1.157359 -0.858785
C  -4.270071 -0.174815 1.433049
C  -3.59488 -1.391984 -2.068312
C  0.622951 -1.038796 0.684816
C  -2.312932 -0.908195 -2.25332
C  2.881433 -0.63125 -0.300356
C  4.962619 -0.590792 -1.135278
C  3.670269 1.360257 -1.012553
C  4.873415 0.776564 -1.368251
C  6.203569 -2.604007 -1.256392
C  2.28044 3.269894 -0.836514
H  1.001629 0.908965 0.126739
H  -5.22923 -1.512859 -0.707659
H  -4.10019 -1.928938 -2.857197
H  -1.79221 -1.045636 -3.191289
H  2.08004 -2.381372 0.337314
H  5.684967 1.344357 -1.798703
H  6.112755 -2.864771 -0.202617
H  5.459891 -3.155681 -1.830226
H  7.196163 -2.872134 -1.606574
H  1.442138 2.867338 -1.405718
H  2.391717 4.323578 -1.075737
H  2.08897 3.170602 0.232109
elementType: S F O N C H
totalener: -1850.43822046 hartree
nucrepener: 2869.15408246 hartree
electener: -4719.59230292 hartree
oneelecener: -8250.53649150 hartree
twoeener: 3530.94418858 hartree
cpcmener: -0.04844685 hartree
kineticenergy: 1844.16002491 hartree
xcener: -147.913685913109 hartree
chargesum: 0.0000000
charge: 0.870659 -0.173630 -0.163436 -0.172163 -0.488013 -0.510702 -0.476577 -0.300418 -0.297332 -0.192455 -0.333645 -0.132871 -0.426861 -0.431406 0.139473 -0.107528 -0.067879 0.548166 -0.132042 0.367235 0.056084 0.376498 0.421235 0.426123 -0.323227 -0.114068 -0.126266 0.205398 0.156868 0.172073 0.159474 0.194141 0.147584 0.114468 0.114742 0.132425 0.113199 0.139834 0.114842
qa: 0.8707 -0.1736 -0.1634 -0.1722 -0.4880 -0.5107 -0.4766 -0.3004 -0.2973 -0.1925 -0.3336 -0.1329 -0.4269 -0.4314 0.1395 -0.1075 -0.0679 0.5482 -0.1320 0.3672 0.0561 0.3765 0.4212 0.4261 -0.3232 -0.1141 -0.1263 0.2054 0.1569 0.1721 0.1595 0.1941 0.1476 0.1145 0.1147 0.1324 0.1132 0.1398 0.1148
va: 5.7708 1.1321 1.1340 1.1300 1.9964 1.9685 2.0335 2.1219 2.1323 3.0885 3.0168 3.1915 2.9694 2.9790 3.9010 3.7961 3.9476 4.4368 3.9103 4.4172 3.9973 4.2433 4.0152 3.9806 3.9311 3.8447 3.8396 1.0791 1.0038 0.9862 0.9902 1.0156 1.0157 0.9954 0.9956 0.9936 0.9938 0.9959 0.9923
dispcorr: -0.020102469 hartree
energy: -1850.458322926824
dipole: 33.69588 -32.38463 1.31125 -2.45538 0.91249 -1.54289 -18.58247 14.91171 -3.67076
magnitude: 4.19218 au
magnitude: 10.65567 debye
