program: Orca
programVersion: 4.2.1
elementType: S F F F O O O O O N N N N N C C C C C C C C C C C C C H H H H H H H H H H H H
charge: 0
multiplicity: 1
keywords: wb97x-d3
keywords: def2-TZVPP
keywords: def2/J RIJCOSX GRIDX6 NOFINALGRIDX
keywords: grid4 nofinalgrid
keywords: scfconv7
keywords: smallprint printgap noloewdin
keywords: NOSOSCF
formula: C13H12F3N5O5S
InChI: InChI=1S/C13H12F3N5O5S/c1-25-8-6-9(26-2)19-11(18-8)20-12(22)21-27(23,24)10-7(13(14,15)16)4-3-5-17-10/h3-6,20-21H,1-2H3
39 atoms
S  -1.351096 1.108635 -0.049946
F  -4.214854 0.670937 1.996145
F  -4.356906 1.550217 0.025623
F  -5.745015 0.03934 0.640936
O  -1.82591 1.822505 1.113204
O  -1.32947 1.756379 -1.346847
O  -0.258557 -0.507908 2.111498
O  3.580016 1.360807 -2.488072
O  6.310454 -0.983262 0.443269
N  0.209286 0.625964 0.204627
N  -1.489074 -1.371723 -0.793683
N  1.86267 -0.545363 1.341659
N  2.696307 0.415702 -0.602848
N  4.080126 -0.769706 0.897441
C  -2.236919 -0.457581 -0.221335
C  -3.562755 -0.655408 0.154423
C  -4.078044 -1.930414 -0.052095
C  -4.465155 0.410261 0.714038
C  -3.285998 -2.908689 -0.622484
C  0.548548 -0.163139 1.272896
C  -1.996659 -2.578695 -0.997396
C  2.921971 -0.279265 0.498261
C  3.747464 0.659686 -1.380068
C  5.116788 -0.524199 0.108126
C  5.017241 0.205155 -1.070775
C  2.279487 1.852418 -2.806018
C  6.452278 -1.735318 1.646667
H  0.916059 0.777119 -0.527909
H  -5.094015 -2.169428 0.226665
H  -3.669188 -3.904894 -0.785803
H  -1.350476 -3.302147 -1.475824
H  2.088382 -1.10713 2.151957
H  5.87119 0.404433 -1.701127
H  2.393363 2.403078 -3.73536
H  1.568946 1.04063 -2.963873
H  1.906884 2.531495 -2.038885
H  6.173732 -1.151324 2.523047
H  7.506334 -1.990588 1.708724
H  5.863516 -2.651595 1.620761
elementType: S F O N C H
totalener: -1850.43856109 hartree
nucrepener: 2864.05911278 hartree
electener: -4714.49767386 hartree
oneelecener: -8240.35982054 hartree
twoeener: 3525.86214667 hartree
cpcmener: -0.04862583 hartree
kineticenergy: 1844.15155392 hartree
xcener: -147.911925552934 hartree
chargesum: -0.0000000
charge: 0.869187 -0.163694 -0.172156 -0.173015 -0.487260 -0.509275 -0.480388 -0.297325 -0.300235 -0.189802 -0.332838 -0.132796 -0.434227 -0.427059 0.136847 -0.105170 -0.067147 0.547144 -0.133990 0.371299 0.057245 0.377812 0.424774 0.419332 -0.321634 -0.126874 -0.115220 0.206089 0.156275 0.173291 0.159571 0.193412 0.147595 0.139626 0.114580 0.114019 0.113953 0.133176 0.114878
qa: 0.8692 -0.1637 -0.1722 -0.1730 -0.4873 -0.5093 -0.4804 -0.2973 -0.3002 -0.1898 -0.3328 -0.1328 -0.4342 -0.4271 0.1368 -0.1052 -0.0671 0.5471 -0.1340 0.3713 0.0572 0.3778 0.4248 0.4193 -0.3216 -0.1269 -0.1152 0.2061 0.1563 0.1733 0.1596 0.1934 0.1476 0.1396 0.1146 0.1140 0.1140 0.1332 0.1149
va: 5.7710 1.1332 1.1297 1.1327 1.9963 1.9692 2.0291 2.1316 2.1211 3.0948 3.0202 3.1918 2.9756 2.9691 3.9069 3.7921 3.9487 4.4373 3.9105 4.4129 3.9971 4.2415 3.9837 4.0157 3.9304 3.8401 3.8454 1.0755 1.0039 0.9857 0.9903 1.0162 1.0155 0.9960 0.9928 0.9931 0.9955 0.9932 0.9952
dispcorr: -0.019986922 hartree
energy: -1850.458548007479
dipole: 36.26054 -34.45288 1.80767 -10.72657 7.24142 -3.48516 -7.63058 6.39033 -1.24025
magnitude: 4.11730 au
magnitude: 10.46536 debye
