program: Orca
programVersion: 4.2.1
elementType: S F F F O O O O O N N N N N C C C C C C C C C C C C C H H H H H H H H H H H H
charge: 0
multiplicity: 1
keywords: wb97x-d3
keywords: def2-TZVPP
keywords: def2/J RIJCOSX GRIDX6 NOFINALGRIDX
keywords: grid4 nofinalgrid
keywords: scfconv7
keywords: smallprint printgap noloewdin
keywords: NOSOSCF
formula: C13H12F3N5O5S
InChI: InChI=1S/C13H12F3N5O5S/c1-25-8-6-9(26-2)19-11(18-8)20-12(22)21-27(23,24)10-7(13(14,15)16)4-3-5-17-10/h3-6,20-21H,1-2H3
39 atoms
S  -1.528076 1.182498 -0.744886
F  -5.002614 0.248652 1.998012
F  -3.282125 1.464604 2.403274
F  -4.178203 1.472814 0.442548
O  -1.392862 2.239925 0.234229
O  -2.416511 1.310164 -1.873015
O  -0.408187 -0.324331 -3.162711
O  5.697791 -1.761616 -0.62391
O  3.150877 1.305517 1.75648
N  0.010964 0.892659 -1.264072
N  -1.156504 -1.347234 -0.193422
N  1.6215 -0.488591 -2.203699
N  3.659811 -1.118156 -1.420216
N  2.368982 0.433795 -0.20384
C  -1.936344 -0.347016 0.140767
C  -2.966158 -0.445383 1.073645
C  -3.139884 -1.683902 1.678933
C  -3.857544 0.695694 1.477298
C  -2.317454 -2.74025 1.331451
C  0.334373 -0.002013 -2.268406
C  -1.337135 -2.528179 0.380139
C  2.58532 -0.37791 -1.225452
C  4.602985 -1.035889 -0.492957
C  3.32345 0.509559 0.718576
C  4.496925 -0.219813 0.628026
C  5.819015 -2.625179 -1.751265
C  1.934995 2.041682 1.869381
H  0.753014 1.034284 -0.556926
H  -3.911063 -1.834336 2.421356
H  -2.43787 -3.710284 1.791278
H  -0.672151 -3.323926 0.070479
H  1.866784 -1.10521 -2.967384
H  5.27335 -0.161389 1.376754
H  5.025975 -3.372841 -1.774252
H  5.815006 -2.069134 -2.688817
H  6.777319 -3.124797 -1.63555
H  1.780756 2.70522 1.018225
H  2.038283 2.642891 2.768777
H  1.075728 1.380074 1.987483
elementType: S F O N C H
totalener: -1850.43807524 hartree
nucrepener: 2908.85271698 hartree
electener: -4759.29079222 hartree
oneelecener: -8328.98296650 hartree
twoeener: 3569.69217428 hartree
cpcmener: -0.04294422 hartree
kineticenergy: 1844.16698393 hartree
xcener: -147.912493466244 hartree
chargesum: -0.0000000
charge: 0.859308 -0.172666 -0.163627 -0.165382 -0.488317 -0.464397 -0.428870 -0.291472 -0.288910 -0.209176 -0.307941 -0.140151 -0.422471 -0.423508 0.135684 -0.110291 -0.066203 0.538672 -0.135817 0.332755 0.046065 0.366259 0.416184 0.422721 -0.324799 -0.114448 -0.123777 0.196009 0.154471 0.169470 0.151359 0.188547 0.144784 0.112610 0.113731 0.130978 0.117742 0.137735 0.107137
qa: 0.8593 -0.1727 -0.1636 -0.1654 -0.4883 -0.4644 -0.4289 -0.2915 -0.2889 -0.2092 -0.3079 -0.1402 -0.4225 -0.4235 0.1357 -0.1103 -0.0662 0.5387 -0.1358 0.3328 0.0461 0.3663 0.4162 0.4227 -0.3248 -0.1144 -0.1238 0.1960 0.1545 0.1695 0.1514 0.1885 0.1448 0.1126 0.1137 0.1310 0.1177 0.1377 0.1071
va: 5.8204 1.1339 1.1328 1.1393 1.9889 2.0129 2.0857 2.1318 2.1421 3.0654 3.0147 3.1738 2.9678 2.9847 3.9093 3.7929 3.9536 4.4406 3.9251 4.4625 4.0088 4.2534 4.0230 3.9836 3.9259 3.8490 3.8481 1.0969 1.0037 0.9872 0.9925 1.0187 1.0165 0.9960 0.9955 0.9937 0.9899 0.9962 0.9955
dispcorr: -0.020981069 hartree
energy: -1850.459056309012
dipole: 33.76941 -31.34075 2.42867 -13.29564 9.96117 -3.33447 -2.43046 4.74331 2.31285
magnitude: 4.72931 au
magnitude: 12.02095 debye
